program: Gaussian 09
title: 000181551
version: EM64L-G09RevD.01
frameworkgroup: C1[X(C8H7ClO2)]
method: RPBEPBE
basis: SDD
operation: Freq
keyword: #p
keyword: freq=noraman
keyword: PBEPBE/SDD
title: #p freq=noraman PBEPBE/SDD
converged: NO YES NO NO
title: Mulliken charges:
elementType: Cl O O C C C C C C C C H H H H H H H
charge: -0.108377 -0.428877 -0.073849 0.488880 -0.610618 -0.345241 -0.353432 -0.379654 -0.338460 0.287961 -0.002095 0.278099 0.279207 0.234243 0.236074 0.223737 0.255653 0.356745
chargesum: 0.00000
title: Mulliken charges with hydrogens summed into heavy atoms:
elementType: Cl O O C C C C C C C C
charge: -0.108377 -0.072131 -0.073849 0.488880 -0.053312 -0.110997 -0.117358 -0.155916 -0.082807 0.287961 -0.002095
polarizability: 1.56954366e+02 3.55500619e+00 8.74402036e+01 -1.67743309e+01 7.93204782e-01 6.05117507e+01
1716.lowfreq: -9.8851 -4.5988 -0.0030 -0.0020 -0.0017 2.7465 20.5224 30.9674 61.2328
frequency: 19.7789 30.8388 61.2204 171.0141 218.6946 288.3349 345.0065 373.8283 385.7936 398.4101 409.9893 455.6146 482.9010 511.7870 635.4331 671.7341 720.4566 776.6865 811.2688 824.8635 852.9673 895.7061 926.0688 936.1782 961.5009 1004.3373 1104.5541 1144.8610 1174.8961 1183.1949 1215.0547 1253.1204 1292.3434 1320.9019 1395.8233 1427.8081 1429.2474 1508.7334 1599.8245 1630.0952 1766.4542 3003.5445 3054.2752 3117.2191 3130.9582 3141.5854 3175.0136 3579.5179
redmass: 5.2573 6.7892 8.9570 6.9781 13.7420 2.3843 6.0747 1.1236 16.4546 3.0211 2.9146 4.0226 6.1669 2.9122 6.8183 4.8093 4.3292 3.1793 1.5659 2.7281 2.2359 2.0738 4.3793 1.4016 1.3633 2.8159 1.4330 1.3575 1.1159 1.1116 2.0154 2.7813 1.7122 1.2835 6.0458 1.3838 1.9198 2.7990 6.4856 6.4321 10.9150 1.0614 1.0983 1.0876 1.0904 1.0968 1.0954 1.0661
irintensity: 1.4834 1.1456 1.1214 2.6762 3.0129 4.1610 5.3241 147.1390 28.3657 13.1428 0.2222 1.6636 50.1767 46.1395 1.0836 111.9278 9.8726 50.5797 23.1945 23.8308 28.3259 2.5873 158.3712 0.1914 0.1404 3.2334 52.3475 212.7941 1.7433 6.0275 1.2374 38.0120 15.0801 10.4271 14.2149 22.3345 28.5085 78.5152 13.5645 56.9679 232.1998 13.1781 0.3004 14.8463 14.2973 11.0883 4.3955 46.2112
temp: 298.150 k
press: 1.00000 atm
elementType: 17 8 8 6 6 6 6 6 6 6 6 1 1 1 1 1 1 1
symmnumber: 1
zpe: 339855.7 jmol-1
zpe.correction: 0.129444 hartree
zpe.thermalcorrener: 0.139850 hartree
zpe.thermalcorrenthalpy: 0.140794 hartree
zpe.thermalcorrgfe: 0.090863 hartree
zpe.sumelectzpe: -918.764952 hartree
zpe.sumelectthermal: -918.754547 hartree
zpe.sumelectthermalent: -918.753602 hartree
zpe.sumelectthermalfe: -918.803534 hartree
dipole: -2.9422 -1.3678 -2.2333
dipole: 3.9389
quadrupole: -76.9712 -61.6756 -76.1104
quadrupole: 8.9652 -4.8872 0.2190
quadrupole: -5.3855 9.9101 -4.5247 8.9652 -4.8872 0.2190
hfenergy: -918.8943966 hartree
pointgroup: C01 [X(C8H7Cl1O2)]
dipole: -1.1781216 -0.5722507 -0.8283123 debye
dipolederiv: -1.3364686 -0.0244672 0.2254203 -0.0219677 -0.1690394 0.0115017 0.2640397 0.0115579 -0.3108492 -1.5387421 -0.051205 0.2313855 -0.0390967 -0.0662233 0.0130193 0.2605506 0.0169095 -0.4793297 -0.70982 -0.0103883 0.1158149 -0.0329389 -0.1787157 0.0617986 0.3836304 0.0575952 -0.9497363 -0.0034629 -0.0114381 0.0034985 0.0224994 -0.1631327 -0.0026369 -0.0154474 0.0048457 -0.1195693 0.1152836 0.008017 -0.0681714 0.0081533 0.1002265 0.0195258 -0.1069841 0.0205033 -0.1810512 0.093626 0.074909 -0.0588599 0.0258537 0.1290241 0.008018 -0.0487921 -0.0265673 -0.1007255 0.1070718 -0.040225 -0.0709416 -0.0383324 0.1375997 0.0098414 -0.0657529 0.0317493 -0.1080663 -0.3740781 -0.0184784 0.0232561 0.3146966 0.0105249 -0.0575619 0.0517457 0.0098093 -0.1977312 -0.3269698 -0.0097694 0.02177 -0.3124406 0.0187131 0.0700317 0.0326146 0.008388 -0.1615832 1.45591 0.0752432 -0.3030795 0.0621205 0.0772621 -0.0143102 -0.3370723 -0.0165604 0.1576929 2.0242243 0.0266362 -0.2449137 0.0499226 0.1374584 -0.0876184 -0.6081664 -0.0844169 1.267689 -0.0242381 0.0196802 0.0001493 0.066397 0.0270806 -0.0805374 0.0316488 -0.0369355 0.094431 -0.016907 -0.0190292 -0.0061498 -0.0679899 0.012037 0.0695153 0.0225896 0.0262437 0.1097718 0.0381801 0.0945704 0.0383864 0.0894081 -0.0379603 -0.0227086 0.0304342 -0.0261473 0.1307742 0.0440842 -0.0995546 0.0305438 -0.087396 -0.0434238 0.0101112 0.0225606 0.0173013 0.134247 -0.0137629 -0.1035188 0.036376 -0.0978119 -0.0413324 0.0131311 0.0478747 0.0159272 0.1635746 0.0465558 0.0688796 0.0282984 0.0712822 -0.0044029 -0.0209798 0.0384744 -0.0202319 0.1636402 0.4195138 0.0201384 -0.0027833 -0.0123594 0.0543042 -0.0001407 -0.0039482 -0.0099711 0.3868212 unknown
polarizability: 155.9583576|3.2177277|87.4851059|-19.4450703|-0.282948|61.4628568 unknown
InChI: InChI=1S/C8H7ClO2/c9-8(11)5-6-1-3-7(10)4-2-6/h1-4,10H,5H2
charge 0 multiplicity 1
18 atoms
Cl 4.444844 0.013033 -0.264696
O  -3.909212 0.031994 0.463851
O  2.360742 -0.133971 1.520106
C  0.209408 0.023059 -0.541657
C  1.686357 0.048323 -0.883555
C  -0.481917 -1.205577 -0.41188
C  -0.506137 1.228902 -0.326364
C  -1.852046 -1.237883 -0.078762
C  -1.873764 1.215903 0.00636
C  -2.546176 -0.021622 0.131353
C  2.607458 -0.039568 0.328828
H  1.976907 -0.786094 -1.550038
H  1.974461 0.969261 -1.424733
H  0.050778 -2.150816 -0.570456
H  0.009888 2.192049 -0.418664
H  -2.3723 -2.199662 0.014938
H  -2.431752 2.141792 0.171758
H  -4.291939 -0.876922 0.545512
