program: Gaussian 09
title: 000181549
version: EM64L-G09RevD.01
frameworkgroup: C1[X(C16H32O)]
method: RPBEPBE
basis: SDD
operation: Freq
keyword: #pfreq=noraman
keyword: PBEPBE/SDD
title: #p freq=noraman PBEPBE/SDD
converged: YES YES NO NO
title: Mulliken charges:
elementType: O C C C C C C C C C C C C C C C C H H H H H H H H H H H H H H H H H H H H H H H H H H H H H H H H
charge: -0.427524 -0.385262 -0.386239 -0.386557 -0.384191 -0.383523 -0.382189 -0.386059 -0.372424 -0.371669 -0.353389 -0.376523 -0.356483 -0.454648 -0.696923 -0.140177 -0.218215 0.193782 0.192398 0.192953 0.193801 0.192992 0.194315 0.193059 0.192135 0.191988 0.193530 0.191529 0.191980 0.192852 0.195462 0.189326 0.188817 0.189347 0.192872 0.187471 0.187541 0.197070 0.209431 0.194548 0.194641 0.198179 0.191853 0.209645 0.214727 0.209621 0.237789 0.210029 0.356309
chargesum: 0.00000
title: Mulliken charges with hydrogens summed into heavy atoms:
elementType: O C C C C C C C C C C C C C C C C
charge: -0.071215 0.000918 0.000515 0.000751 0.001002 0.001995 0.001321 0.002254 0.005719 0.010551 0.021623 0.029979 0.032705 -0.064616 -0.062931 0.097612 -0.008185
polarizability: 2.56648253e+02 -4.62753928e+00 1.47003351e+02 -1.10961500e+01 -2.38111899e+00 1.45968319e+02
1716.lowfreq: -49.2565 -8.8670 -7.0588 -0.0018 0.0013 0.0018 1.8102 15.4782 23.1633
frequency: -32.3989 8.5869 19.5868 26.2804 37.2672 48.3047 55.6553 75.3376 77.7669 94.3900 106.1844 114.1775 130.3963 131.8488 138.9137 144.0266 148.5102 155.8654 181.0499 222.5146 231.7687 259.4140 284.5508 297.6378 350.0905 376.5929 424.4735 453.8673 487.9960 503.0690 553.2873 716.6068 718.3854 720.0016 725.0397 735.5826 754.2749 780.2397 797.8731 822.6573 863.2323 887.0262 907.0325 927.9832 950.1790 972.4683 976.8990 989.8249 998.3918 1008.5989 1020.3763 1033.5254 1042.0120 1044.9673 1064.7688 1075.8922 1078.8727 1081.3919 1082.0052 1087.7038 1091.1515 1118.7568 1123.3458 1171.1575 1180.0254 1195.1781 1195.9221 1216.4999 1218.6363 1237.6400 1240.8934 1256.9327 1262.0788 1273.0741 1275.8847 1280.4256 1281.7571 1283.9671 1289.1087 1291.0080 1295.9714 1296.4045 1298.5189 1310.3125 1321.7357 1333.1585 1343.9546 1349.5320 1350.9173 1351.6226 1354.4234 1355.0181 1386.3235 1457.0672 1457.2348 1458.3091 1459.8788 1460.6627 1462.8123 1463.0807 1466.8390 1471.1385 1475.5789 1476.9942 1479.9877 1483.6321 1486.6646 1487.6358 1706.4682 2946.4690 2946.5577 2946.7455 2947.8282 2948.4670 2949.3401 2950.2866 2951.9001 2955.3551 2959.1927 2962.7756 2966.0739 2969.0410 2970.4525 2978.9950 2981.0628 2983.7400 2987.4412 2992.3931 2998.3177 3002.6677 3009.4530 3018.0480 3026.4610 3033.9706 3039.9372 3044.4444 3066.8168 3069.3921 3088.8531 3114.8838 3617.4587
redmass: 1.8653 4.0646 3.6191 3.2760 2.1428 4.0505 2.4328 2.0139 3.2356 2.3533 2.0756 2.4008 1.9639 2.6230 3.9390 2.3339 1.9681 2.0017 1.9295 2.1118 1.1055 3.9881 3.1421 2.2910 3.1675 3.8506 3.0110 3.3969 2.9969 3.0439 3.3069 1.0590 1.0620 1.0702 1.0887 1.1168 1.1580 1.2550 1.6028 1.2936 1.2751 1.9074 1.2751 1.0894 1.3015 5.4305 2.9084 1.7921 3.3334 2.0069 2.2149 1.2869 2.4319 3.0600 2.8981 2.5330 2.1147 2.2894 2.1643 2.9143 3.0581 1.5403 2.8695 1.3906 1.8461 1.2908 1.5947 1.4845 1.3033 1.3717 1.3089 1.3002 1.2954 1.2139 1.0211 1.0550 1.2790 1.0943 1.1290 1.0905 1.1543 1.1069 1.2554 1.3340 1.3172 1.3736 1.4536 1.5869 1.6215 1.6510 1.6374 1.6353 1.2164 1.0755 1.0735 1.0784 1.0739 1.0688 1.0687 1.0693 1.0878 1.0895 1.0864 1.0474 1.0910 1.0935 1.0898 1.0967 5.4576 1.0588 1.0584 1.0598 1.0588 1.0589 1.0592 1.0593 1.0594 1.0593 1.0590 1.0586 1.0586 1.0598 1.0363 1.0959 1.0964 1.0973 1.0986 1.1000 1.1003 1.1004 1.1038 1.1048 1.1051 1.1050 1.1047 1.1044 1.1007 1.0992 1.0938 1.0898 1.0671
irintensity: 1.0555 0.1170 0.2726 0.2834 0.8881 0.1644 2.1033 1.0249 0.0165 3.6450 1.8771 3.8117 0.3205 3.7534 0.8738 33.5488 2.3140 16.3823 44.4644 28.7648 0.0589 0.4674 2.6647 17.7680 2.5464 4.4200 1.2797 3.8769 1.4493 0.8987 18.9136 16.3362 4.6957 9.3142 0.1210 2.1125 0.1948 0.8715 0.3270 0.1140 0.7615 4.9681 0.4211 85.5979 1.0900 1.9568 0.4095 1.4139 5.6050 2.8212 5.8505 0.2118 0.4775 7.6932 7.9246 2.2512 0.6058 2.6686 1.3806 33.4021 165.3357 7.0783 9.1216 32.2456 4.6325 31.4877 15.2670 4.4238 3.0309 4.2800 1.8500 2.5330 0.9928 0.9021 0.2550 1.2175 2.0700 0.0479 0.2598 0.7161 1.3400 0.2608 5.9686 7.3624 2.3772 0.2516 0.2006 0.9866 0.5553 0.4595 0.0896 0.0797 11.1719 0.3013 0.0027 0.9229 0.0653 0.4803 0.0921 0.4268 0.3426 1.7916 1.6477 11.2465 2.9268 0.6761 1.0520 51.3929 63.8982 2.1707 0.0469 8.6272 2.6373 1.7846 2.9483 11.2757 0.2782 5.0870 1.8229 114.0726 184.4612 157.6926 39.5430 0.0769 0.1770 0.4461 0.7587 1.2994 3.1268 4.9030 0.4086 1.1171 1.9310 8.1988 94.9582 353.1642 98.3232 55.7335 27.3387 23.3016 41.9509
temp: 298.150 k
press: 1.00000 atm
elementType: 8 6 6 6 6 6 6 6 6 6 6 6 6 6 6 6 6 1 1 1 1 1 1 1 1 1 1 1 1 1 1 1 1 1 1 1 1 1 1 1 1 1 1 1 1 1 1 1 1
symmnumber: 1
zpe: 1166439.0 jmol-1
zpe.correction: 0.444273 hartree
zpe.thermalcorrener: 0.466997 hartree
zpe.thermalcorrenthalpy: 0.467941 hartree
zpe.thermalcorrgfe: 0.387365 hartree
zpe.sumelectzpe: -702.675337 hartree
zpe.sumelectthermal: -702.652614 hartree
zpe.sumelectthermalent: -702.651669 hartree
zpe.sumelectthermalfe: -702.732246 hartree
dipole: 0.0956 1.0043 -1.6924
dipole: 1.9703
quadrupole: -108.0556 -113.3318 -105.3063
quadrupole: 8.1371 -19.1234 -0.1469
quadrupole: 0.8423 -4.4339 3.5916 8.1371 -19.1234 -0.1469
hfenergy: -703.1196106 hartree
pointgroup: C01 [X(C16H32O1)]
dipole: -0.036231 0.2757242 0.7235607 debye
polarizability: 256.6614145|6.172792|146.1395386|-10.2406237|2.4366144|146.8189699 unknown
InChI: InChI=1S/C16H32O/c1-2-3-4-5-6-7-8-9-10-11-12-13-14-15-16-17/h15-17H,2-14H2,1H3
charge 0 multiplicity 1
49 atoms
O  -9.96837 -0.833362 0.149458
C  1.243016 0.465153 0.15337
C  2.518711 -0.373407 -0.085484
C  -0.064672 -0.317277 -0.102938
C  3.824716 0.410842 0.173753
C  -1.337242 0.536077 0.097377
C  5.102023 -0.418684 -0.087261
C  -2.647476 -0.244543 -0.151893
C  6.40706 0.367491 0.171708
C  -3.914934 0.626778 -0.001846
C  7.685515 -0.457346 -0.098684
C  -5.226871 -0.153067 -0.241845
C  8.98976 0.331876 0.157392
C  -6.489468 0.744728 -0.136771
C  10.262433 -0.499128 -0.114283
C  -7.775071 -0.001189 -0.423684
C  -8.791687 -0.114834 0.464447
H  1.243891 0.845721 1.196463
H  1.266988 1.360693 -0.502848
H  2.518708 -0.748812 -1.130466
H  2.495217 -1.272004 0.566364
H  -0.053797 -0.718743 -1.138112
H  -0.102864 -1.198996 0.570818
H  3.831613 0.774394 1.222892
H  3.840097 1.316969 -0.467974
H  -1.299219 1.412207 -0.5839
H  -1.345651 0.946449 1.129068
H  5.095024 -0.780506 -1.136998
H  5.087674 -1.325794 0.55297
H  -2.624439 -0.681909 -1.172125
H  -2.70425 -1.101645 0.551345
H  6.417039 0.7245 1.223113
H  6.417788 1.277629 -0.464428
H  -3.85927 1.476919 -0.714324
H  -3.93445 1.075037 1.013916
H  7.676202 -0.815517 -1.149698
H  7.67817 -1.366847 0.53836
H  -5.198516 -0.622333 -1.247066
H  -5.310983 -0.983874 0.487075
H  8.996485 1.239617 -0.48037
H  8.997771 0.690654 1.207094
H  -6.375718 1.585951 -0.853687
H  -6.532406 1.200376 0.873506
H  10.29795 -1.393879 0.535845
H  11.179732 0.089714 0.071346
H  10.291181 -0.847714 -1.164128
H  -7.880169 -0.485818 -1.404086
H  -8.743897 0.345024 1.463807
H  -10.607442 -0.811175 0.901015
