program: Gaussian 09
title: 000181535
version: EM64L-G09RevD.01
frameworkgroup: C1[X(C13H13NO4)]
method: RPBEPBE
basis: SDD
operation: Freq
keyword: #p
keyword: freq=noraman
keyword: PBEPBE/SDD
title: #p freq=noraman PBEPBE/SDD
converged: YES YES NO NO
title: Mulliken charges:
elementType: O O O O N C C C C C C C C C C C C C H H H H H H H H H H H H H
charge: -0.265595 -0.229786 -0.382809 -0.291927 -0.158979 0.346842 0.154590 -0.370119 -0.324558 0.079407 0.107558 -0.480091 -0.381070 0.322907 -0.662901 -0.376813 0.102786 -0.534907 0.231935 0.236724 0.286407 0.266301 0.285222 0.246492 0.237400 0.227488 0.249472 0.226851 0.227211 0.248513 0.375450
chargesum: 0.00000
title: Mulliken charges with hydrogens summed into heavy atoms:
elementType: O O O O N C C C C C C C C C C C C C
charge: -0.265595 -0.229786 -0.007359 -0.291927 -0.158979 0.346842 0.154590 0.098540 -0.038151 0.079407 0.107558 -0.213790 -0.095848 0.322907 0.048479 -0.127341 0.102786 0.167668
polarizability: 2.63757476e+02 -3.01130769e+00 1.80338514e+02 2.17928196e-01 -7.82123164e+00 7.97116809e+01
1716.lowfreq: -6.0248 -0.0004 0.0005 0.0008 6.9362 9.9880 32.6351 40.5187 76.0206
frequency: 32.6196 40.4924 76.0197 90.4042 93.2283 116.5395 138.3055 192.0450 204.8884 216.7429 222.1817 248.9333 272.9910 305.2318 317.6440 341.5727 370.1352 392.1964 427.5056 431.5209 482.5538 518.1787 528.8224 554.2807 597.8488 607.0100 630.0228 640.3735 677.8097 706.6662 732.9747 759.7116 792.4099 801.3956 835.9291 838.0175 860.2058 903.7740 948.8674 960.6406 991.6320 1006.7656 1033.3009 1058.3305 1088.4040 1111.1921 1112.7676 1134.0898 1144.0725 1171.7964 1186.3488 1240.8534 1251.3371 1265.0283 1276.9349 1335.1359 1352.0154 1374.3530 1382.9541 1399.2281 1406.5776 1436.2317 1464.3035 1468.2646 1469.8019 1472.3305 1478.8689 1485.7833 1505.0215 1551.1604 1557.7209 1585.7051 1624.6457 1634.8175 2968.6899 2995.6058 3024.5497 3060.5113 3074.5248 3093.8063 3105.5241 3130.9468 3148.9248 3149.2474 3172.5389 3182.8030 3491.6551
redmass: 8.6690 7.9020 3.8481 2.9938 3.9442 4.2706 5.5450 1.6445 2.9582 1.8307 1.4115 3.4147 7.4116 3.8432 4.2688 4.4625 7.6251 5.1613 4.6502 3.5269 3.9773 5.4827 3.7451 4.7010 1.4460 4.9693 4.2821 4.3618 2.9931 5.3810 4.7672 5.7474 2.6348 1.2390 4.3765 2.0054 1.7097 7.3153 2.4591 1.4180 1.3376 5.0062 2.9722 3.8592 1.9956 1.9707 1.2714 1.5634 1.5967 1.3922 2.0267 2.5581 2.0006 2.0859 1.4758 1.7975 1.5240 3.7168 3.5610 1.2340 5.2755 1.2050 2.1557 1.0510 1.2162 1.3584 1.6589 1.1760 1.1612 8.2553 7.4099 7.4619 7.4028 7.3742 1.0326 1.0361 1.0613 1.1045 1.1027 1.0995 1.1022 1.1001 1.0888 1.0926 1.0950 1.0911 1.0634
irintensity: 3.9363 0.0336 1.2985 1.8481 1.9797 6.8330 0.6058 3.4186 0.4832 3.9357 0.6833 1.9791 1.1024 0.8052 0.4441 3.4502 12.7850 0.3493 2.4168 4.0018 8.5858 2.3820 2.5746 63.6481 105.8338 19.1370 26.0148 17.1728 12.6123 5.9174 27.2136 6.8797 32.1896 13.8807 2.5852 12.5736 39.9190 9.9531 11.5638 13.2555 1.7753 50.9054 190.0638 221.8649 11.4736 112.7619 3.5215 6.2740 8.8385 9.2431 135.2717 33.4024 242.7871 16.8958 9.3716 21.5621 28.8507 6.3486 23.5263 18.7165 44.7383 15.1845 48.9569 18.5267 2.6807 206.1923 31.1735 13.0611 15.6829 72.2044 77.0240 510.7579 338.8245 202.7080 69.2484 17.3591 27.2420 41.6631 1.4250 33.3432 26.4113 22.3583 0.1535 2.3650 12.7263 3.2302 32.1797
temp: 298.150 k
press: 1.00000 atm
elementType: 8 8 8 8 7 6 6 6 6 6 6 6 6 6 6 6 6 6 1 1 1 1 1 1 1 1 1 1 1 1 1
symmnumber: 1
zpe: 625442.3 jmol-1
zpe.correction: 0.238218 hartree
zpe.thermalcorrener: 0.254775 hartree
zpe.thermalcorrenthalpy: 0.255720 hartree
zpe.thermalcorrgfe: 0.193516 hartree
zpe.sumelectzpe: -857.534021 hartree
zpe.sumelectthermal: -857.517464 hartree
zpe.sumelectthermalent: -857.516520 hartree
zpe.sumelectthermalfe: -857.578724 hartree
dipole: -6.0715 3.9454 -0.2433
dipole: 7.2449
quadrupole: -94.2861 -100.3654 -106.2604
quadrupole: 9.0727 -0.4460 -0.1623
quadrupole: 6.0178 -0.0614 -5.9564 9.0727 -0.4460 -0.1623
hfenergy: -857.7722399 hartree
pointgroup: C01 [X(C13H13N1O4)]
dipole: 2.3678868 1.5859767 0.0485868 debye
polarizability: 263.5695728|4.3840928|180.3901336|-3.9421017|8.0552449|79.8479649 unknown
InChI: InChI=1S/C13H13NO4/c1-3-14-7-10(13(16)17)12(15)9-5-4-8(18-2)6-11(9)14/h4-7,16H,3H2,1-2H3
charge 0 multiplicity 1
31 atoms
O  4.263427 0.242124 0.061356
O  -1.549767 -2.570349 -0.186206
O  -4.173347 -1.638315 -0.016498
O  -4.4736 0.632298 0.297149
N  -0.417779 1.439017 0.327103
C  0.591955 0.452512 0.167018
C  0.188718 -0.911302 -0.00084
C  -0.076436 2.882054 0.468803
C  -1.738214 1.070916 0.300042
C  -1.246055 -1.343636 -0.031046
C  -2.205937 -0.232008 0.133743
C  1.965103 0.794877 0.179608
C  1.19591 -1.895875 -0.145612
C  2.940995 -0.21349 0.032757
C  0.229389 3.563657 -0.880393
C  2.561129 -1.574834 -0.131387
C  -3.684463 -0.346638 0.148912
C  5.333899 -0.751424 -0.084622
H  -0.937413 3.373756 0.952953
H  0.775857 2.97579 1.164036
H  -2.47468 1.872196 0.422513
H  2.317094 1.821656 0.297529
H  0.854521 -2.929096 -0.270409
H  1.083344 3.089991 -1.393344
H  -0.64547 3.513189 -1.551713
H  0.474783 4.627943 -0.714125
H  3.30941 -2.363384 -0.246445
H  5.269178 -1.270075 -1.060016
H  5.307044 -1.492563 0.736609
H  6.267249 -0.172628 -0.032575
H  -5.169045 -1.587257 0.0107
