program: Gaussian 09
title: 000181533
version: EM64L-G09RevD.01
frameworkgroup: C1[X(C15H31NO2)]
method: RPBEPBE
basis: SDD
operation: Freq
keyword: #p
keyword: freq=noraman
keyword: PBEPBE/SDD
title: #p freq=noraman PBEPBE/SDD
converged: YES YES NO NO
title: Mulliken charges:
elementType: O O N C C C C C C C C C C C C C C C H H H H H H H H H H H H H H H H H H H H H H H H H H H H H H H
charge: -0.275139 -0.240262 -0.582598 -0.386060 -0.384401 -0.384284 -0.382143 -0.384777 -0.372584 -0.377576 -0.353440 -0.377366 -0.356553 -0.312675 -0.696602 0.280980 -0.217922 -0.685862 0.194968 0.193556 0.194013 0.192619 0.193149 0.196132 0.191689 0.192435 0.194831 0.199879 0.189849 0.188970 0.191305 0.202529 0.187384 0.187874 0.232934 0.205460 0.195012 0.194512 0.233276 0.223066 0.209475 0.215029 0.209742 0.243535 0.223997 0.228611 0.219213 0.291701 0.272518
chargesum: 0.00000
title: Mulliken charges with hydrogens summed into heavy atoms:
elementType: O O N C C C C C C C C C C C C C C C
charge: -0.275139 -0.240262 -0.018378 0.002464 0.002231 0.004997 0.001981 0.009933 0.006234 0.016259 0.021818 0.061028 0.032971 0.143667 -0.062356 0.280980 0.025613 -0.014040
polarizability: 2.34013671e+02 4.42443185e+00 1.54701471e+02 -1.60468388e+00 2.23737199e+00 1.48817178e+02
1716.lowfreq: -20.2582 -5.2030 -0.0016 0.0011 0.0015 6.0212 13.6332 16.8648 23.3066
frequency: -13.3626 15.5580 22.7975 27.8571 39.5371 48.9917 54.7002 61.8294 83.6827 89.3950 95.3227 122.6976 127.7743 137.9216 147.5374 150.4139 153.6820 202.5059 218.6449 222.8264 242.3236 258.0644 270.8404 288.4153 327.0095 347.9224 358.1525 415.3011 441.1453 488.3192 498.5832 513.8783 595.1961 636.4238 710.3600 719.9433 722.2939 728.5333 740.8511 749.5465 766.8131 795.8310 836.7425 875.4364 885.9215 887.1483 931.2287 941.6473 980.0166 988.4541 990.2329 999.8065 1016.8078 1028.7476 1033.3316 1045.5667 1051.4060 1061.6874 1069.9233 1076.7470 1080.3631 1081.3834 1090.8862 1123.8209 1166.8195 1183.3620 1192.5516 1202.3322 1207.0880 1230.9709 1233.1908 1236.8232 1256.6468 1260.4083 1276.2485 1277.6111 1282.9770 1285.5140 1290.3516 1291.4589 1295.9275 1297.3065 1298.7676 1311.3942 1333.2312 1348.0687 1352.3379 1354.6635 1356.6200 1364.8246 1369.3192 1374.7652 1385.2331 1452.9698 1459.3122 1459.4579 1462.6065 1463.3559 1464.1666 1466.1029 1469.2083 1473.5945 1474.2546 1475.0161 1478.7170 1483.4869 1487.2549 1488.8953 1621.3672 1648.6762 2947.6273 2947.8004 2949.6885 2950.5067 2953.1779 2955.4266 2959.9300 2964.5349 2967.2496 2970.4553 2975.2683 2981.0313 2984.3413 2988.0482 2989.7122 2995.6678 3003.5199 3013.5532 3020.7970 3024.2389 3033.8867 3037.3981 3041.3737 3053.0397 3066.9236 3069.6797 3075.9237 3089.8593 3100.4199 3466.1804 3601.3463
redmass: 2.6310 3.9045 2.8027 3.2277 3.5689 3.3115 2.6072 2.3007 3.5420 2.9113 1.7003 2.3614 1.7990 4.5385 2.1420 3.3767 2.0277 2.2691 2.7911 1.2163 1.1614 2.5225 1.5824 2.5496 3.1004 3.0891 3.5116 2.9913 3.8533 2.9115 3.2078 3.5550 1.5937 2.5826 6.0899 1.0587 1.0688 1.0838 1.1179 1.8549 1.4330 1.3335 1.2701 2.2498 1.6279 1.4274 2.8412 1.3458 4.9974 3.5064 1.1930 1.6685 3.9360 1.0717 3.4187 2.3977 3.2309 2.3675 2.6618 2.5444 2.0847 2.1865 2.7520 3.0605 1.7694 1.8022 2.5667 1.2845 1.5125 1.4028 1.4055 1.7824 1.3020 1.2995 1.0867 1.1404 1.0589 1.2387 1.1178 1.1234 1.1113 1.1455 1.2348 1.3345 1.4022 1.4918 1.7096 1.6385 1.6197 1.3831 1.3108 1.2867 1.2164 1.0930 1.0737 1.0735 1.0666 1.0717 1.0493 1.0713 1.0805 1.0781 1.0711 1.0430 1.0867 1.0924 1.0956 1.0966 1.1061 8.6184 1.0585 1.0586 1.0590 1.0592 1.0591 1.0593 1.0592 1.0588 1.0586 1.0364 1.0341 1.0961 1.0968 1.0714 1.0882 1.0993 1.1022 1.1040 1.0575 1.1048 1.1048 1.0865 1.1045 1.1037 1.1007 1.0993 1.1000 1.1006 1.1086 1.0442 1.0986
irintensity: 0.4229 0.7247 0.0040 1.0871 0.4319 0.5417 0.3439 0.6310 0.8130 0.2505 0.0512 0.1538 0.0901 0.2008 0.2039 0.6491 0.1339 4.9274 0.8126 0.0672 3.2507 16.7381 63.9639 2.6751 3.5625 3.7623 13.2749 0.8585 3.6235 0.0925 1.1183 8.8675 245.5089 25.8969 6.5359 17.8021 0.0371 6.5535 1.8629 11.5688 0.3875 1.7713 0.3666 6.4950 2.8909 4.1051 21.7469 3.1521 0.1623 2.2892 1.1879 72.4280 5.9068 0.1027 2.2492 24.8370 0.5365 174.4505 3.3242 17.7761 0.3114 0.7545 31.5859 6.8889 6.3794 1.5381 41.0212 20.1718 1.1576 11.6129 15.5973 89.5150 0.5712 5.7246 0.9975 0.4269 0.2602 2.3631 0.3600 0.5809 0.1282 0.3554 2.7146 1.1635 1.1233 0.2744 0.4323 0.4990 0.3259 11.8499 7.7751 10.3448 11.0989 7.1950 0.0577 0.0926 0.0304 0.2306 6.9623 0.8304 0.8933 9.5763 7.3670 12.1816 1.7595 1.2656 2.7229 43.7663 79.5912 137.2844 0.0048 0.0752 0.0597 0.7317 0.3396 3.2588 6.2727 87.2911 222.1920 37.8815 21.4493 0.1396 0.0152 18.2365 9.6314 1.7265 0.9551 0.1850 45.7220 6.0825 0.9766 11.3889 224.0003 76.3599 99.3080 56.1519 36.1181 38.2093 29.3933 4.0885 3.4973
temp: 298.150 k
press: 1.00000 atm
elementType: 8 8 7 6 6 6 6 6 6 6 6 6 6 6 6 6 6 6 1 1 1 1 1 1 1 1 1 1 1 1 1 1 1 1 1 1 1 1 1 1 1 1 1 1 1 1 1 1 1
symmnumber: 1
zpe: 1151648.5 jmol-1
zpe.correction: 0.438640 hartree
zpe.thermalcorrener: 0.461901 hartree
zpe.thermalcorrenthalpy: 0.462845 hartree
zpe.thermalcorrgfe: 0.381911 hartree
zpe.sumelectzpe: -793.893738 hartree
zpe.sumelectthermal: -793.870477 hartree
zpe.sumelectthermalent: -793.869533 hartree
zpe.sumelectthermalfe: -793.950467 hartree
dipole: -0.8064 0.7566 -2.6000
dipole: 2.8253
quadrupole: -116.0647 -113.3551 -117.4492
quadrupole: 11.2765 -15.5377 0.8419
quadrupole: -0.4417 2.2679 -1.8262 11.2765 -15.5377 0.8419
hfenergy: -794.3323779 hartree
pointgroup: C01 [X(C15H31N1O2)]
dipole: -0.3028496 -0.5610556 0.9105519 debye
polarizability: 233.9435189|-5.065891|153.162691|-1.2381834|3.5370525|150.4261102 unknown
InChI: InChI=1S/C15H31NO2/c1-3-4-5-6-7-8-9-10-11-12-13-18-15(17)14(2)16/h14H,3-13,16H2,1-2H3
charge 0 multiplicity 1
49 atoms
O  5.131438 0.387205 0.401145
O  5.190264 0.396732 -1.932351
N  7.793887 -0.156999 0.442417
C  -2.491037 -0.211611 0.119977
C  -3.842842 0.536947 0.099587
C  -1.270181 0.733059 0.190162
C  -5.065192 -0.406361 0.037065
C  0.081711 -0.015129 0.197863
C  -6.416522 0.343266 0.012385
C  1.300112 0.932105 0.280599
C  -7.640097 -0.598924 -0.043845
C  2.648478 0.174663 0.258369
C  -8.99106 0.152297 -0.068991
C  3.838095 1.136109 0.373514
C  -10.208158 -0.796407 -0.121295
C  5.705874 0.083786 -0.836329
C  6.990134 -0.728103 -0.652051
C  6.603087 -2.23216 -0.478808
H  -2.411127 -0.84694 -0.787016
H  -2.468981 -0.904554 0.987169
H  -3.866803 1.225599 -0.770926
H  -3.920555 1.177151 1.003509
H  -1.346595 1.36268 1.101563
H  -1.297313 1.430975 -0.672681
H  -5.043213 -1.092987 0.909313
H  -4.986737 -1.04882 -0.865116
H  0.106343 -0.720546 1.054558
H  0.162756 -0.635163 -0.719002
H  -6.440122 1.026809 -0.862266
H  -6.493083 0.989107 0.912441
H  1.227657 1.539508 1.207205
H  1.264093 1.646724 -0.567469
H  -7.618553 -1.282079 0.831194
H  -7.56557 -1.245492 -0.943511
H  2.737338 -0.397271 -0.684588
H  2.683497 -0.552312 1.093248
H  -9.012312 0.83296 -0.944671
H  -9.063531 0.799904 0.828825
H  3.860901 1.843395 -0.475153
H  3.830973 1.686606 1.329052
H  -10.225292 -1.466677 0.758964
H  -11.160819 -0.235412 -0.137678
H  -10.17539 -1.433419 -1.025549
H  7.550073 -0.61705 -1.597606
H  6.004076 -2.370139 0.439279
H  6.021151 -2.603476 -1.342935
H  7.521771 -2.841029 -0.394356
H  7.26911 -0.038304 1.313993
H  8.702064 -0.611524 0.5725
