program: Gaussian 09
title: 000181502
version: EM64L-G09RevD.01
frameworkgroup: C1[X(C10H9N3O)]
method: RPBEPBE
basis: SDD
operation: Freq
keyword: #p
keyword: freq=noraman
keyword: PBEPBE/SDD
title: #p freq=noraman PBEPBE/SDD
converged: YES YES NO NO
title: Mulliken charges:
elementType: O N N N C C C C C C C C C C H H H H H H H H H
charge: -0.226114 -0.405902 -0.004182 -0.027325 0.303354 -0.072249 -0.351571 -0.351459 0.230644 0.006528 -0.243794 -0.232214 -0.228696 -0.765990 0.307411 0.270221 0.337290 0.230390 0.226755 0.230137 0.287573 0.239133 0.240059
chargesum: 0.00000
title: Mulliken charges with hydrogens summed into heavy atoms:
elementType: O N N N C C C C C C C C C C
charge: -0.226114 -0.068612 -0.004182 -0.027325 0.303354 -0.072249 -0.044160 -0.081237 0.230644 0.006528 -0.013404 -0.005459 0.001441 0.000775
polarizability: 2.24882430e+02 1.25112670e+01 1.35978318e+02 1.16578904e-01 -2.34988444e-02 5.61980193e+01
1716.lowfreq: -47.7026 -7.2831 -2.9485 -0.0008 -0.0007 -0.0005 2.9749 16.2225 27.4986
frequency: -47.6982 16.0927 27.3934 127.0189 157.3527 182.5736 291.8095 312.8126 325.8984 334.7484 400.2421 430.1948 522.6962 528.9507 552.0780 586.6689 604.2336 616.7126 685.0441 688.6052 699.4809 721.6181 763.0563 808.0387 866.2407 937.9906 958.4845 959.5123 988.4857 1000.7589 1004.3363 1013.9042 1034.6218 1045.3188 1083.2580 1099.4261 1160.2251 1174.0051 1198.1227 1291.1685 1302.1971 1323.5314 1378.7916 1391.5400 1406.1529 1434.5357 1456.1577 1468.8106 1482.0110 1505.5768 1558.0632 1578.4042 1595.4824 1610.3901 2991.1546 3072.5961 3126.5203 3138.0463 3140.0129 3157.0244 3171.1469 3184.7287 3547.8413
redmass: 1.0609 4.5011 4.8142 5.2505 4.5005 4.3325 6.5138 3.3064 4.7943 7.0115 2.9207 7.7284 3.9317 8.1733 6.7088 7.1851 4.1721 6.4609 8.8125 1.2368 1.7768 6.2580 2.2676 3.8952 1.2491 2.6630 1.4133 4.4506 6.2332 1.3648 4.9861 1.3246 2.0661 1.5447 1.7668 3.2984 4.6471 1.0543 1.1852 2.8203 3.9135 1.4564 6.1535 1.4869 2.2036 2.2003 1.3171 1.0443 2.4449 2.5433 4.6791 5.9239 6.1958 5.9878 1.0389 1.0982 1.0853 1.0973 1.0902 1.0959 1.0964 1.0957 1.0795
irintensity: 0.1538 0.0715 3.1427 1.4858 3.6444 1.1436 1.6348 0.5099 1.2509 2.6074 0.0001 2.6635 11.9788 5.4444 0.4777 8.3302 2.6575 0.6477 9.8633 57.8467 110.6433 0.6378 34.7513 18.8157 0.0708 29.6097 7.0759 1.2335 0.1997 0.0175 3.0341 1.9011 7.2134 5.5363 19.4980 1.7316 39.3719 0.0456 12.1231 12.1222 206.0546 6.9400 8.1357 40.9898 40.9202 59.9481 2.9009 20.9649 8.4729 65.9650 262.2292 4.4535 38.3349 12.3660 11.6019 12.3925 0.3210 1.7629 20.3955 25.5594 11.9030 26.3096 53.0652
temp: 298.150 k
press: 1.00000 atm
elementType: 8 7 7 7 6 6 6 6 6 6 6 6 6 6 1 1 1 1 1 1 1 1 1
symmnumber: 1
zpe: 455896.2 jmol-1
zpe.correction: 0.173642 hartree
zpe.thermalcorrener: 0.184664 hartree
zpe.thermalcorrenthalpy: 0.185609 hartree
zpe.thermalcorrgfe: 0.134524 hartree
zpe.sumelectzpe: -624.938519 hartree
zpe.sumelectthermal: -624.927496 hartree
zpe.sumelectthermalent: -624.926552 hartree
zpe.sumelectthermalfe: -624.977636 hartree
dipole: -2.1069 -5.5963 -0.0100
dipole: 5.9798
quadrupole: -56.4040 -84.3842 -83.7033
quadrupole: 13.5089 0.1217 -0.0491
quadrupole: 18.4265 -9.5537 -8.8728 13.5089 0.1217 -0.0491
hfenergy: -625.1121608 hartree
pointgroup: C01 [X(C10H9N3O1)]
dipole: 0.7931125 -2.1950571 -0.295944 debye
dipolederiv: -0.5768387 0.2063745 0.0271555 0.1944085 -0.9684055 -0.0853749 0.0262673 -0.0840178 -0.3764016 -1.1906354 0.1446307 0.0043782 -0.4398263 -0.4659819 -0.0455465 -0.0656889 -0.0296837 -0.1953757 0.2953848 -0.3614203 -0.0422243 0.2945399 -0.0715271 0.021525 0.039712 0.0095826 -0.1692491 -0.6917597 0.5421069 0.0725969 -0.0269651 -0.6744824 -0.0549438 -0.0061509 -0.0500121 -0.3040028 -0.3997514 0.0164676 -0.0049788 -0.1306607 -0.0141048 -0.0008701 -0.0212565 0.0012413 -0.0245358 0.9823032 -0.1058552 0.0070767 -0.0222601 -0.3095029 -0.0616261 0.0133043 -0.0614106 0.0971151 0.0423122 0.1046176 0.0192758 -0.1440875 -0.0586704 0.00716 -0.0160739 0.0111657 -0.1211013 0.034282 -0.1147463 -0.0133078 0.1430206 -0.0185719 0.0210611 0.0226823 0.0150886 -0.1356881 0.9920341 -0.0525383 0.0007309 0.3997728 0.9710043 0.121901 0.0605942 0.1113879 0.1340186 0.556074 -0.4367315 -0.0649075 -0.3024406 1.1348015 0.1209884 -0.0433143 0.1195616 0.3091078 -0.1010268 -0.181219 -0.0253547 -0.2413345 0.0676124 0.0291185 -0.0356536 0.0296436 -0.1562078 -0.1789392 0.1550196 0.0225997 0.2191929 0.0750138 0.0395488 0.0322412 0.0382802 -0.1527281 0.0921079 -0.000973 0.0048627 -0.0453523 0.0256273 0.0235353 -0.002059 0.0252572 -0.1381634 -0.3630382 0.0313934 -0.0002413 0.1044975 -0.04019 -0.009602 0.0055192 -0.0094829 0.0504318 0.2369933 -0.0483041 -0.0064395 0.001861 0.0667388 -0.0148146 0.000891 -0.0147771 0.1621154 0.1028395 0.0873774 0.012365 0.0507487 0.0048556 -0.0211562 0.0075632 -0.0200801 0.1481951 0.1533955 0.0002351 -0.0026475 -0.0400108 0.2054704 -0.0163687 -0.0071263 -0.0170521 0.3235925 0.0046107 0.0816514 0.0090624 0.1164625 -0.0589393 -0.0297066 0.0140102 -0.0305008 0.152687 0.0093437 -0.0817342 -0.0151134 -0.1137533 -0.0740105 -0.0366889 -0.0196622 -0.036316 0.1511739 -0.1466119 -0.0033569 -0.0067264 -0.009571 0.0977929 -0.0091623 -0.0075418 -0.008959 0.1565045 0.0820155 -0.0176392 -0.0022927 -0.1002918 -0.0006001 -0.0168862 -0.0115391 -0.0167672 0.1326066 0.0320969 0.0165372 0.0105578 0.0391314 0.0772466 -0.0944923 0.0679863 -0.0868933 -0.0462604 0.0328082 0.0181064 -0.0064279 0.0529181 0.0288232 0.1124012 -0.0547047 0.104744 0.0021657 unknown
polarizability: 224.4032384|-14.2174365|134.8627866|0.9736972|11.0128726|57.7927422 unknown
InChI: InChI=1S/C10H9N3O/c1-7-11-10(14)9(13-12-7)8-5-3-2-4-6-8/h2-6,12H,1H3
charge 0 multiplicity 1
23 atoms
O  0.687151 2.330231 0.441936
N  2.272038 -1.329373 -0.04242
N  0.895324 -1.280472 -0.056628
N  2.5856 0.993762 0.263858
C  -1.1646 -0.059256 0.065429
C  0.322219 -0.070929 0.093985
C  -1.921441 1.137449 0.227222
C  -1.865748 -1.288032 -0.131414
C  3.094115 -0.221401 0.108526
C  1.16815 1.172844 0.27916
C  -3.332948 1.096541 0.191936
C  -3.270772 -1.319108 -0.165022
C  -4.01511 -0.123925 -0.003011
C  4.584316 -0.458187 0.089124
H  -1.394666 2.081711 0.378162
H  -1.288556 -2.208438 -0.256435
H  2.651337 -2.270067 -0.15915
H  -3.898078 2.026536 0.318256
H  -3.789832 -2.271965 -0.317619
H  -5.110407 -0.148229 -0.029282
H  5.085788 0.512233 0.209465
H  4.911958 -0.911489 -0.864593
H  4.900561 -1.124835 0.912614
