program: Gaussian 09
title: 000181545
version: EM64L-G09RevD.01
frameworkgroup: C1[X(C16H18NO6P)]
method: RPBEPBE
basis: SDD
operation: Freq
keyword: #p
keyword: freq=noraman
keyword: PBEPBE/SDD
title: #p freq=noraman PBEPBE/SDD
converged: YES YES NO NO
title: Mulliken charges:
elementType: P O O O O O O N C C C C C C C C C C C C C C C C H H H H H H H H H H H H H H H H H H
charge: 1.400798 -0.539969 -0.505850 -0.509587 -0.604655 -0.212900 -0.211958 0.024434 0.357862 0.366904 0.366581 -0.372311 -0.362621 -0.367138 -0.392697 -0.363761 -0.365527 -0.375046 -0.374972 0.379441 -0.216768 -0.255586 -0.656395 -0.645290 0.242751 0.242794 0.303866 0.256679 0.249117 0.246561 0.285902 0.285242 0.236971 0.233444 0.229958 0.243095 0.211168 0.235684 0.238624 0.218908 0.232261 0.243987
chargesum: 0.00000
title: Mulliken charges with hydrogens summed into heavy atoms:
elementType: P O O O O O O N C C C C C C C C C C C C C C C C
charge: 1.400798 -0.539969 -0.505850 -0.509587 -0.604655 -0.212900 -0.211958 0.024434 0.357862 0.366904 0.366581 -0.129561 -0.119828 -0.063272 -0.136018 -0.114644 -0.118966 -0.089144 -0.089730 0.379441 0.253647 0.217467 0.029081 0.049865
polarizability: 4.44721085e+02 -1.96389865e+01 1.52777317e+02 5.43285329e-01 1.49234446e+01 1.97917830e+02
1716.lowfreq: -26.1555 -11.7365 -3.2754 -0.0012 0.0004 0.0012 2.1711 13.7013 17.2135
frequency: -25.9081 12.0008 17.1645 32.1399 35.0642 39.9323 56.1585 58.1832 59.4318 79.6501 84.1430 109.0293 139.3700 167.8566 185.7054 196.7056 226.3932 230.2226 241.7201 249.1249 268.8898 281.3029 305.3776 335.8495 354.9735 384.0807 409.7272 411.7386 415.3484 424.3233 442.9552 474.8253 492.6262 516.2993 540.0426 567.7769 605.1723 622.1383 634.7327 664.2568 669.1172 701.9240 721.4056 722.5896 748.3620 793.8347 795.6684 810.2975 829.0513 834.3160 843.7586 847.0648 857.4797 871.2493 881.4883 958.3851 973.0441 986.6938 991.3198 992.7255 1004.9012 1005.7159 1012.8436 1020.5276 1055.0505 1091.3051 1097.0947 1107.1846 1116.1692 1120.4383 1131.4278 1139.0022 1173.4606 1184.6460 1212.7322 1225.7674 1248.7676 1269.7925 1292.6550 1300.7801 1306.3447 1339.3975 1351.3731 1353.6764 1363.9292 1389.7591 1391.2371 1395.9719 1421.6065 1425.7802 1457.0393 1460.8719 1463.4667 1471.5365 1478.6118 1479.4785 1488.7126 1510.1161 1569.4990 1590.0094 1604.6938 1614.9390 2987.6943 2996.6206 3009.3825 3017.9536 3075.5607 3079.3633 3088.4939 3093.8788 3110.8819 3115.9514 3139.1182 3141.8965 3150.6565 3152.8335 3161.3016 3174.4662 3182.6819 3185.3252
redmass: 2.5217 5.3262 4.3106 3.9553 4.3788 4.3456 2.2702 4.8454 6.5267 5.3517 4.4453 5.9035 7.9844 3.0289 5.4768 5.6519 3.1581 5.4607 1.8986 1.3833 3.0697 5.7258 5.4832 6.5219 6.5862 3.5689 3.7125 3.5407 3.9723 5.4436 4.9512 5.7947 4.5629 5.6074 3.3689 5.0190 7.1500 7.1142 7.2769 9.1314 4.5939 5.9174 4.0001 7.8286 4.0006 5.3736 1.2239 1.0876 1.8950 2.1688 1.5058 1.3928 3.6572 1.7767 4.8056 1.3579 1.3518 1.3370 2.4754 2.0659 2.7855 2.7941 2.5866 2.4468 12.4720 2.2237 3.0427 2.2707 1.3359 1.3673 1.3901 1.5523 1.9047 1.4384 2.0772 2.8686 1.1599 1.1163 2.9588 1.3002 1.3487 3.3327 1.2153 1.2565 9.2428 8.8278 1.2452 1.2421 4.7904 3.4739 1.0393 1.0579 1.0611 2.1904 1.0605 1.0550 1.0840 2.8336 6.8729 7.9971 6.0644 6.3463 1.0361 1.0362 1.0569 1.0606 1.1083 1.1009 1.0996 1.0977 1.1055 1.1031 1.0890 1.0892 1.0891 1.0896 1.0966 1.0961 1.0947 1.0960
irintensity: 0.5928 0.1802 0.9640 2.2940 0.3332 0.9231 3.9798 1.1590 0.2658 3.1405 0.4482 1.7230 2.2559 4.5920 2.2637 2.9856 0.2048 5.5168 2.9955 1.8365 15.0260 7.1617 14.0602 19.8642 17.0662 4.3371 25.0334 12.8045 7.9846 2.5635 5.5048 26.1437 50.0730 6.7325 14.9234 15.9288 36.5808 9.4325 25.4637 125.0442 19.2081 95.6034 9.1555 185.9923 4.8525 1.9138 5.4866 2.1286 98.5880 134.6991 98.1183 60.0250 144.6179 19.3600 294.0251 2.7663 2.2796 3.5263 6.9203 5.5947 87.0862 85.3614 117.7032 5.3290 104.5309 10.2763 27.2377 19.4991 16.6336 15.3489 4.4685 12.7231 442.3066 201.7854 4.3577 473.7822 0.3398 0.1420 45.6057 0.5411 2.5754 7.0977 9.2507 2.0775 89.1387 23.3361 15.5082 27.0188 20.3242 10.0992 12.1696 10.9793 6.2699 104.4265 20.5587 6.1153 12.2344 75.5936 5.3403 7.6098 311.9106 12.4726 10.4838 19.7074 21.1779 31.4622 7.2596 16.8381 21.6186 23.1862 26.5022 34.7220 5.2022 9.4673 9.7122 3.2381 1.3461 4.5468 0.1439 3.6212
temp: 298.150 k
press: 1.00000 atm
elementType: 15 8 8 8 8 8 8 7 6 6 6 6 6 6 6 6 6 6 6 6 6 6 6 6 1 1 1 1 1 1 1 1 1 1 1 1 1 1 1 1 1 1
symmnumber: 1
zpe: 830235.8 jmol-1
zpe.correction: 0.316220 hartree
zpe.thermalcorrener: 0.340111 hartree
zpe.thermalcorrenthalpy: 0.341055 hartree
zpe.thermalcorrgfe: 0.258172 hartree
zpe.sumelectzpe: -1465.966006 hartree
zpe.sumelectthermal: -1465.942116 hartree
zpe.sumelectthermalent: -1465.941172 hartree
zpe.sumelectthermalfe: -1466.024054 hartree
dipole: 6.5898 -0.0134 -3.5543
dipole: 7.4872
quadrupole: -201.7491 -138.5461 -146.4298
quadrupole: -0.2575 -17.3003 0.8644
quadrupole: -39.5074 23.6956 15.8118 -0.2575 -17.3003 0.8644
hfenergy: -1466.2822266 hartree
pointgroup: C01 [X(C16H18N1O6P1)]
dipole: 2.6305605 -0.3437863 -1.2802624 debye
polarizability: 442.5365138|-29.0205982|161.1779347|13.8548626|20.8786533|191.7017838 unknown
InChI: InChI=1S/C16H18NO6P/c1-3-21-24(20,22-4-2)23-16-11-7-14(8-12-16)13-5-9-15(10-6-13)17(18)19/h5-12H,3-4H2,1-2H3
charge 0 multiplicity 1
42 atoms
P  4.503407 0.358671 0.581696
O  3.299683 -0.877884 0.258465
O  5.847363 -0.652063 0.81275
O  4.741843 1.056004 -0.981333
O  4.211173 1.378899 1.758125
O  -7.206158 0.202626 -1.531628
O  -7.297097 0.678938 0.698717
N  -6.648928 0.370899 -0.37684
C  -0.904688 -0.290973 -0.001621
C  -2.379064 -0.122302 -0.097575
C  1.910323 -0.614011 0.184671
C  -0.14183 0.440506 0.951134
C  -0.211799 -1.193736 -0.857461
C  1.254628 0.288266 1.055688
C  1.183077 -1.355716 -0.772262
C  -3.156084 0.208317 1.051096
C  -3.056951 -0.286162 -1.341066
C  -4.549253 0.372062 0.97003
C  -4.449541 -0.128539 -1.442076
C  -5.183195 0.201085 -0.28078
C  6.272432 -1.623909 -0.25435
C  4.5193 2.530875 -1.157047
C  7.543543 -2.277566 0.273596
C  3.072585 2.821313 -1.555247
H  -0.638964 1.162595 1.607938
H  -0.770234 -1.800318 -1.578343
H  1.828084 0.853879 1.797321
H  1.716509 -2.054496 -1.422922
H  -2.666577 0.304823 2.025342
H  -2.481747 -0.507266 -2.245837
H  -5.152378 0.616558 1.848236
H  -4.975144 -0.24372 -2.393529
H  5.454792 -2.351825 -0.401272
H  6.444507 -1.061818 -1.190329
H  5.22917 2.79387 -1.958286
H  4.799887 3.054047 -0.224532
H  7.912921 -3.017364 -0.460797
H  8.331457 -1.524247 0.440219
H  7.347341 -2.797342 1.226162
H  2.960133 3.897311 -1.786598
H  2.789212 2.242969 -2.451243
H  2.372559 2.57374 -0.737915
