program: Gaussian 09
title: 000181474
version: EM64L-G09RevD.01
frameworkgroup: C1[X(C19H14O)]
method: RPBEPBE
basis: SDD
operation: Freq
keyword: #pfreq=noraman
keyword: PBEPBE/SDD
title: #p freq=noraman PBEPBE/SDD
converged: YES YES NO NO
title: Mulliken charges:
elementType: O C C C C C C C C C C C C C C C C C C C H H H H H H H H H H H H H H
charge: -0.440579 0.299752 0.257019 0.187294 0.252181 0.121446 0.323457 -0.778165 0.447033 -0.418373 -0.522494 -0.371819 -0.380051 -0.523459 -0.332938 -0.442149 -0.263379 -0.270833 -0.264322 -0.251436 0.225431 0.224515 0.235770 0.223563 0.294762 0.223476 0.220574 0.220797 0.243536 0.228443 0.230801 0.228237 0.230502 0.341405
chargesum: 0.00000
title: Mulliken charges with hydrogens summed into heavy atoms:
elementType: O C C C C C C C C C C C C C C C C C C C
charge: -0.099173 0.299752 0.257019 0.187294 0.252181 0.121446 0.323457 -0.552734 0.447033 -0.193857 -0.286724 -0.148255 -0.085288 -0.079409 -0.112141 -0.198613 -0.034936 -0.040032 -0.036085 -0.020934
polarizability: 3.74884122e+02 -2.07616208e+01 2.31096141e+02 -3.26125417e+00 -6.79643678e+00 8.77389974e+01
1716.lowfreq: -6.1659 -4.6154 -0.0006 -0.0004 -0.0003 3.0599 44.3491 63.0250 95.0702
frequency: 44.3419 63.0204 95.0699 103.9329 147.2638 175.7766 179.3795 220.9514 265.8043 280.1984 299.1464 340.7652 359.3199 379.4304 410.4546 433.9725 473.9385 483.8077 503.9286 517.7421 552.9393 560.9276 562.7773 574.1945 620.6705 663.5100 680.0798 694.9471 751.1321 754.7822 763.2282 772.8479 779.1629 807.1854 848.0362 865.2647 870.7833 883.1772 886.1265 902.5068 932.9432 955.8148 961.5436 978.8677 979.5349 992.2491 993.7291 1017.2834 1037.8723 1046.2580 1060.1477 1104.6234 1154.1734 1159.1849 1164.9953 1179.3556 1186.0425 1230.8415 1238.7368 1253.6899 1269.9679 1276.3336 1294.8199 1307.3391 1360.0372 1373.5574 1387.6832 1404.7567 1409.5498 1415.5364 1438.1796 1446.6378 1450.1191 1476.6394 1489.5201 1522.3757 1533.0958 1575.0093 1604.0617 1613.8978 1622.4319 1627.8555 2971.0052 3056.0807 3122.5227 3126.7241 3129.7750 3132.2733 3138.9029 3146.2308 3153.1606 3160.0599 3166.6300 3169.9386 3174.5200 3560.0677
redmass: 4.6310 4.8756 4.1558 3.9105 4.1091 4.1715 4.5959 3.8467 3.1387 3.9736 3.5798 4.1935 1.4173 4.3486 3.4850 2.9446 4.0452 4.3780 5.1532 5.9380 3.3911 3.1754 7.5424 3.4095 4.6577 5.2026 5.1643 3.3916 1.6542 2.4041 5.1915 1.8668 2.0135 1.7168 1.6029 5.2242 4.3689 1.9035 1.5135 2.8900 3.0880 1.3918 1.4058 1.9945 1.5855 1.3621 1.3533 4.1283 2.4133 2.7660 2.5996 2.6586 1.6126 1.1756 1.2584 1.1114 1.1146 1.7760 2.1014 1.7136 1.7245 1.8793 1.2520 1.8582 2.8000 1.4777 2.9759 3.0240 6.7096 2.4821 3.3613 2.5032 2.3555 1.1131 3.1978 4.0496 3.7546 7.7602 6.5529 6.2610 6.2522 6.4236 1.0664 1.0966 1.0865 1.0878 1.0861 1.0889 1.0904 1.0904 1.0930 1.0963 1.0990 1.0928 1.0974 1.0663
irintensity: 0.1315 0.1806 3.1549 0.0950 0.4129 0.5552 0.5190 6.9552 4.9539 4.3401 17.4882 2.9757 144.1131 5.0046 1.7153 13.2687 3.9643 2.1840 6.3286 1.0446 2.8814 9.8657 0.2971 9.6393 5.6751 1.8883 8.3246 0.5901 4.8322 0.7696 0.4073 74.1152 81.4576 11.3188 38.9161 0.6234 2.4799 11.1049 5.0773 46.4837 52.0543 0.3905 5.6164 2.1930 2.6207 0.0454 1.0693 1.4255 18.6578 2.5860 9.6279 9.5214 0.4541 16.7272 4.8298 4.2990 0.9040 7.5321 1.7259 9.0877 2.4510 12.3099 27.1577 1.1039 1.9143 41.5108 8.2868 0.4728 0.9358 8.5243 0.3108 0.1532 13.8233 7.7005 9.2429 10.6861 3.1265 0.3033 3.8600 0.0735 0.6389 0.6874 56.9606 19.1205 1.2832 4.6037 6.0562 14.3392 1.0203 18.0462 35.9999 3.4312 41.8566 26.4074 25.5340 7.7585
temp: 298.150 k
press: 1.00000 atm
elementType: 8 6 6 6 6 6 6 6 6 6 6 6 6 6 6 6 6 6 6 6 1 1 1 1 1 1 1 1 1 1 1 1 1 1
symmnumber: 1
zpe: 707637.2 jmol-1
zpe.correction: 0.269525 hartree
zpe.thermalcorrener: 0.284571 hartree
zpe.thermalcorrenthalpy: 0.285515 hartree
zpe.thermalcorrgfe: 0.227519 hartree
zpe.sumelectzpe: -806.326322 hartree
zpe.sumelectthermal: -806.311275 hartree
zpe.sumelectthermalent: -806.310331 hartree
zpe.sumelectthermalfe: -806.368327 hartree
dipole: -1.7853 -0.7917 0.1730
dipole: 1.9607
quadrupole: -108.1788 -103.7807 -120.9334
quadrupole: -7.6456 -1.5279 -1.4003
quadrupole: 2.7855 7.1836 -9.9691 -7.6456 -1.5279 -1.4003
hfenergy: -806.5958466 hartree
pointgroup: C01 [X(C19H14O1)]
dipole: -0.685443 -0.3474711 0.0668395 debye
polarizability: 376.7214354|-12.8556369|228.9620189|0.6963465|-9.8222695|88.0358066 unknown
InChI: InChI=1S/C19H14O/c20-12-14-11-19-15-6-2-1-5-13(15)9-10-18(19)17-8-4-3-7-16(14)17/h1-11,20H,12H2
charge 0 multiplicity 1
34 atoms
O  3.049744 3.250745 0.741328
C  -0.65346 0.271415 -0.081079
C  0.068094 -0.962823 0.022361
C  1.531547 -0.951012 0.006454
C  2.239758 0.303636 -0.106155
C  -2.116164 0.271086 -0.064116
C  1.482057 1.537125 -0.221412
C  0.09337 1.49579 -0.207485
C  -2.818258 -0.985217 0.056739
C  -0.676168 -2.192248 0.141646
C  -2.060656 -2.204406 0.158142
C  2.305312 -2.152384 0.096228
C  3.671744 0.309678 -0.107409
C  2.177788 2.875562 -0.394833
C  -2.901629 1.464388 -0.161154
C  -4.248352 -1.007158 0.075581
C  3.704643 -2.124461 0.080777
C  4.395944 -0.88332 -0.019666
C  -4.301343 1.421625 -0.141095
C  -4.985788 0.176391 -0.021826
H  -0.446892 2.443423 -0.302418
H  -0.143244 -3.143016 0.223156
H  -2.603199 -3.152677 0.250733
H  1.806183 -3.121823 0.178455
H  4.195914 1.268187 -0.150538
H  2.870787 2.861776 -1.254128
H  1.421999 3.666845 -0.574005
H  -2.413217 2.438776 -0.25388
H  -4.758858 -1.973102 0.168617
H  4.269356 -3.060708 0.150665
H  5.491159 -0.864575 -0.020905
H  -4.874916 2.351911 -0.217709
H  -6.080674 0.152058 -0.006912
H  2.537222 3.139307 1.582041
