program: Gaussian 09
title: 000181418
version: EM64L-G09RevD.01
frameworkgroup: C1[X(C15H15NO)]
method: RPBEPBE
basis: SDD
operation: Freq
keyword: #p
keyword: freq=noraman
keyword: PBEPBE/SDD
title: #p freq=noraman PBEPBE/SDD
converged: NO YES NO NO
title: Mulliken charges:
elementType: O N C C C C C C C C C C C C C C C H H H H H H H H H H H H H H H
charge: -0.255850 -0.114354 -0.334468 -0.469572 -0.384427 0.342432 0.104131 0.155634 -0.383052 -0.616180 0.410974 -0.364201 -0.260543 -0.461218 -0.432588 -0.274557 -0.243298 0.259284 0.231350 0.251233 0.230179 0.231687 0.252238 0.223534 0.271855 0.227102 0.243585 0.226881 0.238643 0.237928 0.226766 0.228869
chargesum: 0.00000
title: Mulliken charges with hydrogens summed into heavy atoms:
elementType: O N C C C C C C C C C C C C C C C
charge: -0.255850 -0.114354 -0.075184 0.013011 0.077440 0.342432 0.104131 0.155634 -0.130814 0.106311 0.410974 -0.120616 -0.033661 -0.222575 -0.194660 -0.047791 -0.014428
polarizability: 2.22931831e+02 -1.63295268e+01 1.76479940e+02 1.35053518e-01 -7.45065722e+00 1.04870147e+02
1716.lowfreq: -8.1870 -0.0002 0.0000 0.0004 7.1132 9.6366 37.2177 50.5150 86.2895
frequency: 36.9352 50.4657 86.2827 129.5034 153.0271 164.1144 175.0589 187.3778 200.3421 234.0979 289.7452 303.5032 406.1950 423.5818 463.2994 469.9015 484.8880 512.2920 548.5658 559.1377 624.3508 640.4089 667.3586 675.7699 717.4647 744.3084 780.7342 788.7711 805.1935 821.7169 825.0995 877.2427 890.0114 915.1173 933.1417 960.0595 970.2889 983.2269 991.9340 1014.7772 1029.8806 1045.6457 1062.3180 1087.9186 1109.1706 1117.8314 1149.0869 1175.2444 1176.2677 1181.2636 1200.3558 1232.1785 1237.2909 1255.7723 1262.3721 1268.2198 1281.5411 1296.6055 1318.8101 1376.8656 1395.5934 1404.4590 1418.0165 1424.0579 1440.6161 1457.3665 1468.8452 1478.2245 1483.0762 1504.6663 1516.3531 1590.0114 1600.7325 1631.7766 1640.0980 2959.8525 2965.5149 3010.5097 3026.4386 3035.6087 3039.9629 3095.3310 3095.7752 3120.4928 3122.9085 3130.6216 3141.0507 3147.3131 3159.5934 3162.9240
redmass: 4.6149 3.9168 3.6402 3.4613 1.1864 2.8681 4.0390 4.0507 3.8116 3.0508 2.9132 3.4957 4.2927 3.3361 4.7435 3.2677 4.3996 6.5388 5.4329 3.4324 3.5841 5.6656 3.9940 5.4211 2.9171 1.3115 3.5038 2.6684 2.0728 2.3631 2.7727 1.7222 2.3518 1.4720 2.2965 1.4020 2.6165 1.3613 1.3498 3.1874 2.2914 2.8295 1.9034 2.1317 1.8669 1.2846 1.4437 1.1367 1.2354 1.2327 1.3648 1.8437 1.4994 1.5467 1.8483 2.9597 1.8812 1.6484 1.4143 2.1444 2.2167 2.7206 5.2959 1.2715 2.4193 2.3633 1.1119 1.0468 1.0929 1.1383 3.8028 7.4483 5.1088 6.5812 8.8416 1.0539 1.0452 1.0705 1.0872 1.0891 1.1009 1.0988 1.1018 1.0862 1.0863 1.0880 1.0919 1.0942 1.0986 1.1002
irintensity: 1.4504 2.9573 0.7002 0.7891 0.6130 1.7062 3.0320 0.0395 1.6830 7.0431 4.1051 9.0574 3.0208 5.8530 4.4124 0.1235 6.5077 1.5185 3.1938 7.6665 0.2937 4.3132 2.3414 2.7730 2.7002 4.4076 17.2040 44.4161 58.8479 9.7679 2.3641 3.2220 9.8182 3.3576 4.8474 2.4231 7.2104 0.9660 0.4929 9.2268 6.0784 0.3973 24.0608 3.8944 39.8336 0.8426 0.9581 1.0448 5.0808 8.8463 2.5770 0.8363 6.6024 1.3149 5.9950 24.4560 52.9099 20.2273 4.4405 12.8132 47.3680 5.0809 3.7275 49.8319 3.4470 2.9857 6.8609 16.7408 7.0454 12.8189 10.4025 2.3173 9.0177 10.6594 275.2400 33.1081 101.8295 7.9902 14.1106 60.9359 28.9214 8.2876 24.9449 1.4182 2.5143 4.4679 17.5260 41.3190 31.0977 20.9590
temp: 298.150 k
press: 1.00000 atm
elementType: 8 7 6 6 6 6 6 6 6 6 6 6 6 6 6 6 6 1 1 1 1 1 1 1 1 1 1 1 1 1 1 1
symmnumber: 1
zpe: 688078.4 jmol-1
zpe.correction: 0.262075 hartree
zpe.thermalcorrener: 0.276299 hartree
zpe.thermalcorrenthalpy: 0.277243 hartree
zpe.thermalcorrgfe: 0.220569 hartree
zpe.sumelectzpe: -709.389113 hartree
zpe.sumelectthermal: -709.374889 hartree
zpe.sumelectthermalent: -709.373945 hartree
zpe.sumelectthermalfe: -709.430619 hartree
dipole: 0.0742 -1.8100 -3.8971
dipole: 4.2976
quadrupole: -87.1740 -90.1021 -109.4104
quadrupole: 3.5192 10.3635 -4.7031
quadrupole: 8.3882 5.4601 -13.8483 3.5192 10.3635 -4.7031
hfenergy: -709.6511879 hartree
pointgroup: C01 [X(C15H15N1O1)]
dipole: 0.0700818 0.7475599 -1.5149365 debye
polarizability: 221.7728292|-17.9498239|176.9623734|5.8941044|8.1558105|105.5467157 unknown
InChI: InChI=1S/C15H15NO/c1-16-10-9-14(15(16)17)13-8-4-6-11-5-2-3-7-12(11)13/h2-8,14H,9-10H2,1H3
charge 0 multiplicity 1
32 atoms
O  2.794892 -0.631629 2.001716
N  3.40657 0.261128 -0.090652
C  1.194285 0.748664 0.62894
C  1.590585 1.716187 -0.534652
C  2.821078 1.039295 -1.197337
C  0.080898 -0.232842 0.24331
C  2.529448 0.042742 0.965968
C  -1.277369 0.25219 0.105482
C  0.348017 -1.585519 -0.001378
C  4.738961 -0.333699 -0.152026
C  -2.321508 -0.670692 -0.300823
C  -1.647233 1.617172 0.361566
C  -0.68262 -2.491526 -0.401639
C  -1.99347 -2.043644 -0.553326
C  -3.668415 -0.196196 -0.437725
C  -2.96854 2.050152 0.224027
C  -3.991364 1.137593 -0.183122
H  0.880376 1.313801 1.525311
H  1.887761 2.696971 -0.121113
H  0.772154 1.875434 -1.254038
H  2.525071 0.372513 -2.03365
H  3.548732 1.77517 -1.586937
H  1.363457 -1.970655 0.137093
H  4.822385 -1.050236 -0.99269
H  4.910071 -0.871555 0.795564
H  5.516919 0.443549 -0.274082
H  -0.883515 2.334208 0.679825
H  -0.432473 -3.54281 -0.581035
H  -2.789748 -2.732766 -0.85895
H  -4.445691 -0.90632 -0.745042
H  -3.226846 3.094571 0.43157
H  -5.023571 1.488854 -0.288956
