program: Gaussian 09
title: 000181403
version: EM64L-G09RevD.01
frameworkgroup: C1[X(C17H23F3OS)]
method: RPBEPBE
basis: SDD
operation: Freq
keyword: #p
keyword: freq=noraman
keyword: PBEPBE/SDD
title: #p freq=noraman PBEPBE/SDD
converged: YES YES NO NO
title: Mulliken charges:
elementType: S F F F O C C C C C C C C C C C C C C C C C H H H H H H H H H H H H H H H H H H H H H H H
charge: 0.238433 -0.142792 -0.140696 -0.160231 -0.126162 -0.376633 -0.370151 -0.371646 -0.349303 -0.352587 -0.674231 -0.356417 -0.786171 -0.695766 0.523345 0.220274 -0.420093 -0.341038 0.326202 -0.214430 -0.215192 -0.235465 0.192644 0.194535 0.197775 0.191370 0.189200 0.191259 0.213313 0.212490 0.187827 0.188943 0.284800 0.244484 0.195634 0.194777 0.307150 0.209693 0.215865 0.210111 0.237514 0.262183 0.232502 0.232403 0.234281
chargesum: 0.00000
title: Mulliken charges with hydrogens summed into heavy atoms:
elementType: S F F F O C C C C C C C C C C C C C C C C C
charge: 0.238433 -0.142792 -0.140696 -0.160231 -0.126162 0.010545 0.018994 0.008813 0.076499 0.024182 -0.144947 0.033993 -0.479021 -0.060097 0.523345 0.220274 -0.182580 -0.078855 0.326202 0.018071 0.017211 -0.001184
polarizability: 2.90425714e+02 3.42603800e+01 1.75656228e+02 -6.25765097e+00 -2.65613711e+00 1.72325849e+02
1716.lowfreq: -48.9905 -12.6993 -7.0870 -3.3531 -0.0015 0.0011 0.0019 3.4386 10.2563
frequency: -47.4629 -3.9640 1.9929 19.7813 25.2088 35.8043 40.4910 52.9959 58.3900 80.5600 84.2399 102.3228 126.8053 131.1488 135.8013 137.6959 151.6300 192.8150 215.7638 219.5046 233.5495 244.9219 283.9193 310.0032 315.9206 361.3591 384.0664 400.6631 433.3558 439.0116 472.3238 493.4536 499.9739 542.6316 611.2715 620.9789 682.5335 695.9382 698.6158 719.1966 720.8795 727.1275 747.8389 780.6753 787.6444 794.6268 833.7099 849.8644 851.0763 888.3935 925.2258 927.2696 979.0316 982.2140 987.1826 992.7157 999.4343 1001.6255 1014.5195 1017.3908 1025.8527 1038.5889 1039.6748 1066.1573 1070.0716 1075.8019 1080.0961 1082.0278 1118.3667 1147.3302 1166.2637 1175.4263 1184.6998 1190.0732 1191.6745 1211.1378 1219.4448 1244.7877 1256.1666 1260.1327 1279.6006 1280.8353 1282.6226 1292.9083 1296.5667 1315.6561 1331.1059 1340.8854 1351.5710 1352.6744 1385.3352 1388.1723 1441.7963 1455.0306 1459.8342 1460.6651 1464.6722 1469.8147 1476.9773 1477.8834 1478.2623 1483.6814 1487.1797 1592.0246 1606.2298 1643.4550 2950.1070 2952.0499 2955.8351 2962.0183 2967.3532 2971.7669 2978.6657 2984.5794 2993.4844 3003.3892 3005.5016 3020.4769 3025.9107 3034.2015 3045.5943 3068.5518 3070.5792 3090.1034 3128.3328 3132.0987 3142.8580 3153.8541 3169.1383
redmass: 1.5389 10.7940 5.0859 7.1629 4.2286 5.8221 4.9917 1.8837 3.5623 6.1983 3.5132 1.9275 2.7445 4.1225 2.2118 4.2579 6.9327 4.9949 11.9715 5.7867 1.1074 7.1951 5.7421 5.1484 5.8721 4.6352 12.3699 2.7957 11.2399 3.4475 3.1946 4.3674 9.2963 7.3571 6.8480 11.3088 7.7069 6.3130 1.9638 1.0639 3.0635 1.0820 1.1167 1.9477 1.6450 3.5513 4.8123 1.2278 1.2505 1.8929 1.2213 1.4719 1.4230 4.6594 4.9769 4.5895 1.1892 1.3910 10.7801 3.8252 2.2691 4.7018 5.8033 2.8227 1.1282 2.4096 2.1629 1.6390 2.5361 3.4364 1.3076 1.0580 1.7924 1.6746 1.6069 1.2903 1.4533 1.2756 1.2940 1.5024 1.2820 1.0270 1.1733 1.0782 1.1169 1.3456 1.2697 1.4579 1.5828 1.6678 8.4850 1.2166 2.1707 1.0871 1.0713 1.0726 1.0668 1.0814 1.0744 1.0501 2.2162 1.0872 1.0895 6.1233 6.0225 11.5764 1.0586 1.0586 1.0590 1.0590 1.0586 1.0364 1.0589 1.0968 1.0990 1.0635 1.0964 1.1035 1.0827 1.1042 1.1043 1.1007 1.0993 1.1070 1.0855 1.0883 1.0924 1.0966 1.1017
irintensity: 0.0393 0.0595 0.1540 0.1230 0.0715 0.1037 0.1126 0.2378 0.3631 0.1988 0.3210 0.3207 0.3209 0.3482 0.0682 1.1461 1.4356 0.5294 1.7954 1.7035 0.0105 3.2221 0.6985 0.5835 1.3593 1.7851 3.0322 0.0125 4.2590 0.5257 0.2019 11.1691 1.5082 0.5290 4.4950 38.2919 0.1791 17.6526 36.1221 14.5234 93.6747 0.6627 6.0780 3.8539 0.3645 6.5583 1.9473 1.7944 0.6335 5.8714 0.2945 4.6027 3.6103 80.5391 8.8850 30.4103 1.5007 9.1047 212.8064 3.2932 11.6244 75.3274 105.1003 1.3592 1.6556 0.1057 0.6113 5.0976 21.4995 51.5710 9.6706 0.2569 0.2010 3.8798 0.2063 11.1153 0.3182 6.2836 0.5276 15.6024 6.1417 0.3723 0.1196 0.1675 0.0946 5.0213 1.9165 6.1113 0.0785 0.2598 1.1477 11.3365 9.8333 3.4784 0.0079 0.9653 1.6906 0.9647 3.0449 10.2441 14.5509 3.5680 27.8121 4.5667 1.1199 106.9389 0.0791 1.4431 1.2444 16.7124 135.4140 38.1255 40.3265 0.1885 0.1179 32.3371 4.2305 0.5653 4.4938 31.8568 122.3305 93.5886 55.2029 28.4228 2.4300 0.0499 12.0553 24.8859 22.8097
temp: 298.150 k
press: 1.00000 atm
elementType: 16 9 9 9 8 6 6 6 6 6 6 6 6 6 6 6 6 6 6 6 6 6 1 1 1 1 1 1 1 1 1 1 1 1 1 1 1 1 1 1 1 1 1 1 1
symmnumber: 1
zpe: 948703.0 jmol-1
zpe.correction: 0.361342 hartree
zpe.thermalcorrener: 0.384780 hartree
zpe.thermalcorrenthalpy: 0.385724 hartree
zpe.thermalcorrgfe: 0.301612 hartree
zpe.sumelectzpe: -1432.710820 hartree
zpe.sumelectthermal: -1432.687383 hartree
zpe.sumelectthermalent: -1432.686438 hartree
zpe.sumelectthermalfe: -1432.770550 hartree
dipole: 0.8450 -2.0764 1.7032
dipole: 2.8154
quadrupole: -127.7595 -148.0334 -135.8222
quadrupole: 14.5923 -1.7253 1.5789
quadrupole: 9.4455 -10.8284 1.3828 14.5923 -1.7253 1.5789
hfenergy: -1433.0721622 hartree
pointgroup: C01 [X(C17H23F3O1S1)]
dipole: 0.3210302 -0.9308998 0.5072266 debye
polarizability: 292.1063791|31.6922638|174.7064356|-3.2713555|-2.7261561|171.5949763 unknown
InChI: InChI=1S/C17H23F3OS/c1-2-3-4-5-6-10-13-22-15(16(21)17(18,19)20)14-11-8-7-9-12-14/h7-9,11-12,15H,2-6,10,13H2,1H3
charge 0 multiplicity 1
45 atoms
S  -0.546376 -1.148607 -0.388148
F  -4.184978 2.444918 0.093213
F  -2.323647 3.537035 0.799492
F  -3.159767 1.827122 2.028182
O  -1.476223 1.728002 -1.152162
C  4.818744 -0.741783 -0.221185
C  3.504107 0.024966 0.048999
C  6.083261 0.090293 0.09005
C  2.244941 -0.823487 -0.253321
C  7.398825 -0.675084 -0.17772
C  0.948044 -0.040734 0.012913
C  8.664512 0.15477 0.13696
C  -1.935931 -0.143338 0.416555
C  9.974095 -0.618944 -0.12867
C  -3.266344 -0.866605 0.203511
C  -2.027467 1.281295 -0.127852
C  -3.932397 -1.474092 1.295918
C  -3.831126 -0.947821 -1.09589
C  -2.925677 2.270218 0.702264
C  -5.149301 -2.160543 1.091913
C  -5.048135 -1.633728 -1.296344
C  -5.71018 -2.240963 -0.203929
H  4.832781 -1.670831 0.386095
H  4.843509 -1.063401 -1.283209
H  3.484609 0.94847 -0.565737
H  3.48292 0.352798 1.109263
H  6.057873 0.413192 1.1521
H  6.070115 1.019413 -0.517457
H  2.26943 -1.149807 -1.312361
H  2.259436 -1.742281 0.365629
H  7.412624 -1.605456 0.42809
H  7.427686 -0.99632 -1.240123
H  0.87963 0.856575 -0.624092
H  0.874696 0.25331 1.076521
H  8.65203 1.082634 -0.470841
H  8.633394 0.478201 1.197646
H  -1.727398 -0.085368 1.500682
H  10.026359 -1.533883 0.491394
H  10.863091 -0.003356 0.10179
H  10.043042 -0.928872 -1.18864
H  -3.499375 -1.41138 2.300783
H  -3.312185 -0.487733 -1.944667
H  -5.65785 -2.630947 1.940391
H  -5.479537 -1.694512 -2.301299
H  -6.65526 -2.772433 -0.360514
