program: Gaussian 09
title: 000181416
version: EM64L-G09RevD.01
frameworkgroup: C1[X(C16H20N2O3)]
method: RPBEPBE
basis: SDD
operation: Freq
keyword: #p
keyword: freq=noraman
keyword: PBEPBE/SDD
title: #p freq=noraman PBEPBE/SDD
converged: YES YES NO NO
title: Mulliken charges:
elementType: O O O N N C C C C C C C C C C C C C C C C H H H H H H H H H H H H H H H H H H H H
charge: -0.219002 -0.224645 -0.233759 -0.183656 -0.370488 -0.007429 -0.428662 -0.371807 0.403384 0.138168 0.125783 -0.359832 -0.361425 -0.385946 -0.381438 0.182924 -0.593937 -0.697436 -0.239481 -0.237831 -0.240003 0.234955 0.236304 0.210617 0.208950 0.194273 0.193677 0.198261 0.196908 0.364876 0.278707 0.261155 0.250417 0.269704 0.256157 0.211068 0.215967 0.211097 0.230554 0.229731 0.233141
chargesum: 0.00000
title: Mulliken charges with hydrogens summed into heavy atoms:
elementType: O O O N N C C C C C C C C C C C C C C C C
charge: -0.219002 -0.224645 -0.233759 -0.183656 -0.005611 -0.007429 0.042597 0.047760 0.403384 0.138168 0.125783 0.028118 0.033745 -0.107240 -0.120283 0.182924 0.182341 -0.059304 -0.008927 -0.008100 -0.006862
polarizability: 1.97510804e+02 -1.00477889e+01 1.97107799e+02 -6.47576833e+00 -5.39329589e+00 1.78129259e+02
1716.lowfreq: -6.6980 -3.2183 -0.0005 -0.0004 -0.0001 5.7286 17.8156 32.7179 37.4905
frequency: 17.3978 32.6989 37.3737 45.0792 55.8996 77.1855 99.2441 112.3203 120.9704 135.4901 155.8148 162.1353 169.3654 216.7221 227.2539 238.1347 258.1444 278.3164 309.7077 329.7033 338.6376 373.6976 382.2791 403.2843 422.0511 439.7448 476.2428 531.8305 542.5556 605.6694 614.8357 658.3678 675.4886 697.7496 704.2793 709.2822 715.5258 725.9997 745.1994 765.2465 773.4300 817.4258 857.0600 861.4263 896.3302 911.6587 931.5569 938.2501 985.9457 989.6300 993.8407 1001.2050 1017.8107 1032.6197 1034.6002 1061.2100 1077.8776 1094.1395 1111.5764 1120.1915 1129.4325 1144.7105 1162.1507 1176.3748 1181.4324 1209.9873 1214.8567 1236.7528 1248.7622 1275.5174 1291.8451 1304.3011 1306.7036 1319.4671 1332.1605 1349.5627 1357.2916 1359.3365 1376.2281 1378.9291 1392.1178 1432.5179 1435.9455 1443.1904 1463.1889 1467.5894 1472.6674 1478.2012 1478.8668 1481.7294 1482.6226 1487.7383 1583.7133 1589.7483 1605.7212 1638.8785 1657.5186 2956.0720 2966.0125 2972.4162 2975.3724 2995.4912 3013.5872 3018.1192 3018.7314 3038.8781 3068.8400 3071.3946 3079.4270 3111.1230 3128.3781 3136.9922 3148.8460 3149.7345 3157.8616 3168.9024 3519.1465
redmass: 3.8671 5.7963 4.4553 4.7137 1.5382 3.7036 1.0747 2.9409 4.1027 1.9134 6.3719 10.1928 5.0810 5.4920 4.2950 1.1108 3.4108 3.2689 3.9029 3.7489 3.6743 7.5714 8.8266 2.8673 3.8436 7.4255 5.0478 4.4264 5.8404 6.5602 6.3435 3.0212 2.8690 7.1820 2.0143 5.7414 6.1524 1.1074 1.2700 1.7949 1.8393 1.4618 1.3986 2.4879 1.9819 3.0311 1.4713 1.8307 1.4545 4.8766 1.5797 1.3315 3.5845 2.6729 2.6386 2.7933 2.4655 1.6927 2.8691 3.3528 1.3188 3.5152 2.6798 1.1938 2.5272 1.1351 1.4952 3.0135 1.3154 1.2434 1.0766 1.5829 1.1789 2.5764 1.4091 1.4967 1.6389 4.1637 5.6926 1.9098 1.2171 1.3413 2.0377 1.0923 1.0702 1.0767 1.0499 1.0669 1.0484 1.1137 1.9558 1.0822 10.0484 6.1058 5.7724 6.3539 7.8811 1.0586 1.0590 1.0363 1.0583 1.0984 1.0590 1.1019 1.0334 1.1041 1.1008 1.0993 1.1041 1.1023 1.0849 1.0883 1.1024 1.0927 1.0952 1.1011 1.0768
irintensity: 0.1092 0.4949 0.0213 0.4016 0.0091 0.9499 0.0555 0.3031 0.5037 0.0521 1.4665 12.2856 2.9344 0.1768 0.7569 0.0072 1.7638 2.8937 1.4353 1.9808 7.5458 20.5594 21.2694 0.1268 0.4001 10.0503 2.9745 31.7001 14.4338 5.5133 0.2754 18.8223 9.0334 1.2017 44.1247 7.4108 1.1989 8.8732 1.4857 50.6895 96.5320 0.9845 1.8230 3.6451 7.0958 11.2852 1.2750 4.6810 0.7753 1.4110 7.0329 0.5132 1.5756 17.7263 22.0865 18.9276 0.3789 15.2201 4.5056 21.1400 0.4722 1.2048 0.8955 7.8558 29.9573 7.6290 2.7423 13.6990 5.3037 2.6779 4.0121 76.8681 3.6137 212.3100 26.0779 6.0401 12.3459 155.8301 0.2139 11.6018 11.9972 111.8468 4.5918 37.4005 0.4062 1.0404 15.9195 3.7349 11.4125 21.6002 30.8889 18.7122 264.2098 39.2938 14.0738 339.2431 244.9359 3.7841 26.8189 43.2450 58.6490 0.1155 21.1053 4.7623 18.8943 36.4667 72.8758 52.8159 21.9336 14.0037 0.0614 8.9372 0.4524 7.1004 14.6781 24.7878 67.4136
temp: 298.150 k
press: 1.00000 atm
elementType: 8 8 8 7 7 6 6 6 6 6 6 6 6 6 6 6 6 6 6 6 6 1 1 1 1 1 1 1 1 1 1 1 1 1 1 1 1 1 1 1 1
symmnumber: 1
zpe: 877806.5 jmol-1
zpe.correction: 0.334339 hartree
zpe.thermalcorrener: 0.355260 hartree
zpe.thermalcorrenthalpy: 0.356204 hartree
zpe.thermalcorrgfe: 0.282518 hartree
zpe.sumelectzpe: -955.366326 hartree
zpe.sumelectthermal: -955.345405 hartree
zpe.sumelectthermalent: -955.344460 hartree
zpe.sumelectthermalfe: -955.418147 hartree
dipole: 0.7636 -0.7805 -0.8607
dipole: 1.3904
quadrupole: -122.4772 -124.8497 -127.3609
quadrupole: -9.5970 -4.0459 -3.6255
quadrupole: 2.4187 0.0463 -2.4650 -9.5970 -4.0459 -3.6255
hfenergy: -955.7006646 hartree
pointgroup: C01 [X(C16H20N2O3)]
dipole: -0.3276036 0.2704848 -0.344582 debye
polarizability: 199.2323334|-9.6179775|195.907854|6.1298307|5.3824224|177.6076747 unknown
InChI: InChI=1S/C16H20N2O3/c1-3-4-8-11-16(12-9-6-5-7-10-12)13(19)17-15(21)18(2)14(16)20/h5-7,9-10,17H,3-4,8,11H2,1-2H3
charge 0 multiplicity 1
41 atoms
O  0.27603 -0.952074 -2.090797
O  0.379215 0.254649 2.537303
O  -1.649875 -3.671026 1.169731
N  -0.762482 -2.275547 -0.506048
N  -0.684887 -1.650395 1.790191
C  -0.061834 0.085384 0.11083
C  1.212003 0.949943 -0.157004
C  2.552815 0.20541 0.022396
C  -1.331828 0.987438 -0.084458
C  -0.131427 -1.074008 -0.904973
C  -0.068853 -0.409813 1.566909
C  3.760315 1.118645 -0.288871
C  5.11949 0.404201 -0.112257
C  -1.732848 1.870382 0.952286
C  -2.038059 1.009408 -1.314388
C  -1.087692 -2.598681 0.83187
C  -1.014118 -3.29807 -1.550694
C  6.323327 1.31429 -0.437418
C  -2.828057 2.741627 0.766839
C  -3.134011 1.882993 -1.494323
C  -3.537508 2.75007 -0.455305
H  1.171234 1.814718 0.530026
H  1.132235 1.334094 -1.18998
H  2.640441 -0.165938 1.062908
H  2.587799 -0.674507 -0.650715
H  3.677526 1.494654 -1.32979
H  3.727907 2.010804 0.370833
H  5.203683 0.034402 0.929988
H  5.145859 -0.492855 -0.764223
H  -0.820302 -1.935008 2.765856
H  -1.187325 1.88563 1.901635
H  -1.727317 0.367316 -2.144228
H  -1.611554 -2.855781 -2.363541
H  -1.556166 -4.13174 -1.083028
H  -0.058735 -3.65034 -1.97243
H  6.276951 1.673936 -1.48274
H  7.282275 0.780042 -0.306223
H  6.33879 2.202781 0.221872
H  -3.123802 3.414993 1.578934
H  -3.667825 1.886432 -2.451175
H  -4.388691 3.424945 -0.5970
