program: Gaussian 09
title: 000181391
version: EM64L-G09RevD.01
frameworkgroup: C1[X(C24H24N2O6)]
method: RPBEPBE
basis: SDD
operation: Freq
keyword: #p
keyword: freq=noraman
keyword: PBEPBE/SDD
title: #p freq=noraman PBEPBE/SDD
converged: YES YES NO NO
title: Mulliken charges:
elementType: O O O O O O N N C C C C C C C C C C C C C C C C C C C C C C C C H H H H H H H H H H H H H H H H H H H H H H H H
charge: -0.443974 -0.443930 -0.199897 -0.203848 -0.199938 -0.203784 -0.219980 -0.220033 -0.443856 -0.444058 -0.046944 -0.046839 -0.460399 -0.460438 -0.353703 -0.353424 0.084606 0.082365 0.084541 0.082477 0.176220 0.183496 0.176197 0.183498 -0.354135 -0.354922 -0.354137 -0.354917 -0.211668 -0.211712 -0.211671 -0.211718 0.235948 0.206983 0.206994 0.235978 0.216450 0.216416 0.235470 0.230074 0.235641 0.229922 0.264858 0.240392 0.264759 0.240335 0.330962 0.330881 0.269754 0.269719 0.269753 0.269715 0.238886 0.238877 0.238886 0.238873
chargesum: 0.00000
title: Mulliken charges with hydrogens summed into heavy atoms:
elementType: O O O O O O N N C C C C C C C C C C C C C C C C C C C C C C C C
charge: -0.113012 -0.113050 -0.199897 -0.203848 -0.199938 -0.203784 -0.219980 -0.220033 -0.000925 -0.001086 0.169505 0.169578 0.005145 0.005125 0.151547 0.151671 0.084606 0.082365 0.084541 0.082477 0.176220 0.183496 0.176197 0.183498 -0.084381 -0.085203 -0.084384 -0.085202 0.027218 0.027165 0.027215 0.027155
polarizability: 4.11114553e+02 -5.49629422e-02 2.90091598e+02 -6.11620449e+01 -7.05395822e-02 1.81420107e+02
1716.lowfreq: -2.5698 -0.0010 0.0010 0.0014 1.9973 3.8176 11.4074 14.9105 15.6170
frequency: 3.0700 13.9460 15.5989 16.7347 28.1180 41.7527 43.7092 62.3325 66.6954 90.6747 102.2785 120.5191 137.6859 138.0222 138.4639 138.9723 163.8638 173.6574 182.1705 202.3363 230.3007 231.4323 232.6045 262.3593 266.6227 292.3988 301.8323 328.5904 333.4429 340.9192 366.7906 388.4236 405.9524 419.0709 419.6030 439.8317 456.5149 456.5226 465.4526 499.3595 507.5910 522.9008 522.9886 549.9247 572.7038 606.9635 628.4112 659.4189 659.4204 677.8655 677.8764 699.9204 701.5164 716.0956 718.6022 757.6763 765.0830 765.8414 785.2418 785.2899 795.5703 795.8341 823.7044 840.7008 855.2299 883.1392 906.6042 906.6248 945.3261 948.5722 953.4263 974.2811 974.2969 985.6728 994.8898 1006.1711 1006.1744 1010.2377 1013.7958 1017.0925 1039.1386 1046.2064 1046.2746 1070.0724 1072.4633 1073.9930 1077.3610 1094.1892 1102.6052 1118.0178 1146.8034 1167.7191 1167.7861 1170.8260 1170.8970 1203.1249 1203.2304 1220.8936 1227.6334 1228.4540 1261.0825 1270.2026 1283.4619 1283.5524 1298.4133 1303.7769 1318.2183 1324.7372 1333.7623 1340.7502 1343.8860 1344.6843 1355.1000 1361.5364 1365.5383 1370.5394 1379.5899 1380.4651 1416.2061 1416.2570 1446.6831 1448.8944 1452.1455 1453.3485 1453.3537 1455.4014 1458.1937 1465.1586 1469.2542 1473.9229 1614.8158 1614.8442 1617.4593 1617.5940 1626.5856 1626.9589 1675.7844 1675.8785 2966.7619 2970.0563 2981.7378 2981.8603 3007.1948 3013.7319 3022.8643 3024.3799 3024.7751 3037.2053 3047.7538 3052.3523 3092.9502 3093.0040 3139.2725 3139.2728 3152.7654 3152.7826 3164.3064 3164.3364 3174.3207 3174.3376 3533.0491 3533.2416
redmass: 6.1468 5.9719 8.0811 6.4754 6.4819 4.2244 4.8377 5.1644 4.9895 9.3831 3.8547 2.8891 4.7551 5.0021 4.7698 4.9615 2.8974 8.6760 5.5288 4.1100 5.3449 4.4123 4.8932 3.0236 3.0179 4.3633 2.1874 1.7167 9.5532 6.3450 1.3410 2.2834 2.7930 3.1861 2.6628 4.1388 4.8768 4.8794 2.8792 3.5226 3.3382 7.1806 7.2020 5.0632 6.9897 8.2086 5.0980 4.8111 4.8109 5.2515 5.2595 5.4782 4.8546 3.0836 3.1621 1.3660 1.5471 1.5591 5.3070 5.2609 1.6748 1.6811 3.6962 4.1703 3.5317 2.6915 1.3899 1.3899 6.6491 6.1901 1.8995 1.4133 1.4132 2.4734 4.1847 1.3457 1.3456 2.2463 2.1740 2.0864 4.1487 2.2774 2.8312 1.7580 2.6460 2.1249 3.0192 1.3575 4.7162 2.3623 1.4862 1.2048 1.2038 2.0229 2.0206 2.8905 2.9148 1.5691 1.3874 1.6609 1.2277 1.2224 1.4865 1.4863 1.2875 1.4278 1.2955 1.3663 1.4831 1.3042 2.6142 3.3209 1.4539 1.3274 1.2152 1.5500 1.5127 1.4356 5.9613 5.9492 1.1466 1.3451 1.6879 2.4631 2.4612 1.8156 1.3579 1.1224 1.0981 1.0911 7.6857 7.6865 8.4206 8.3445 10.7157 10.8416 11.7558 11.7525 1.0600 1.0594 1.0615 1.0614 1.0910 1.0859 1.0840 1.0596 1.0678 1.1021 1.0996 1.1000 1.1053 1.1053 1.0864 1.0864 1.0906 1.0906 1.0956 1.0956 1.1004 1.1004 1.0657 1.0657
irintensity: 0.5029 0.5974 0.0738 0.5203 0.1432 0.5517 1.0538 3.8158 2.0785 0.3698 1.0758 0.5777 7.6178 0.0020 3.0010 0.0089 12.8541 0.3172 6.0973 1.9649 1.1041 0.0544 6.6022 7.9621 12.0336 0.0619 287.7114 115.3032 0.0022 47.5963 0.3131 0.2192 3.4046 0.3722 4.8623 134.6433 0.0027 0.0097 2.9082 2.7938 6.0024 0.7292 16.7347 3.4990 0.1350 12.3779 0.1805 0.0426 0.0119 0.5926 0.5520 13.5426 1.5847 145.8589 8.6175 0.0055 0.9420 1.5102 0.1029 0.0636 57.6400 3.2135 8.3543 0.1021 0.9273 129.1824 0.0036 0.0057 0.3067 32.2594 0.5309 1.5612 2.8328 5.5071 11.7168 0.0057 0.0008 14.2958 1.5120 2.4753 8.1042 55.8248 43.7837 10.1499 22.6296 4.8510 0.0439 117.8073 1.3876 19.8595 0.3705 20.0829 0.1228 0.4854 9.1097 44.3168 0.4972 15.2529 24.8344 2.6631 6.5099 0.0167 0.0368 0.0685 6.3552 27.0013 3.6816 1.9089 160.3316 9.2047 486.5599 0.4961 64.5335 14.0320 9.0447 14.8406 42.2601 2.0205 22.3869 1.2183 0.0424 16.7994 0.1644 1.4057 21.4938 3.4197 0.6017 25.7834 0.4878 40.5138 3.1725 1.0921 20.2517 264.0257 40.2101 563.4621 85.6034 3.2837 2.5668 31.4813 15.1571 8.2891 17.1983 1.9317 1.0119 0.0361 47.0631 2.6803 3.7837 83.8997 7.1243 9.0260 0.9928 2.4015 5.8971 4.9965 5.9646 6.2439 37.5693 6.5201 4.1479 6.0372
temp: 298.150 k
press: 1.00000 atm
elementType: 8 8 8 8 8 8 7 7 6 6 6 6 6 6 6 6 6 6 6 6 6 6 6 6 6 6 6 6 6 6 6 6 1 1 1 1 1 1 1 1 1 1 1 1 1 1 1 1 1 1 1 1 1 1 1 1
symmnumber: 1
zpe: 1152167.4 jmol-1
zpe.correction: 0.438837 hartree
zpe.thermalcorrener: 0.468401 hartree
zpe.thermalcorrenthalpy: 0.469345 hartree
zpe.thermalcorrgfe: 0.371754 hartree
zpe.sumelectzpe: -1487.551328 hartree
zpe.sumelectthermal: -1487.521765 hartree
zpe.sumelectthermalent: -1487.520821 hartree
zpe.sumelectthermalfe: -1487.618412 hartree
dipole: -0.0018 0.3154 -0.0041
dipole: 0.3154
quadrupole: -93.9994 -200.4264 -194.3336
quadrupole: -0.0927 -31.2825 0.0363
quadrupole: 68.9204 -37.5066 -31.4138 -0.0927 -31.2825 0.0363
hfenergy: -1487.9901659 hartree
pointgroup: C01 [X(C24H24N2O6)]
dipole: 0.0006853 -0.1240578 -0.0026365 debye
polarizability: 411.228197|-0.5665939|290.0830806|60.945558|0.9653116|181.3149803 unknown
InChI: InChI=1S/C24H24N2O6/c27-15(11-13-25-21(29)17-5-1-2-6-18(17)22(25)30)9-10-16(28)12-14-26-23(31)19-7-3-4-8-20(19)24(26)32/h1-8,15-16,27-28H,9-14H2
charge 0 multiplicity 1
56 atoms
O  -1.644527 1.152427 1.507138
O  1.639913 1.178985 -1.491979
O  -6.281878 -2.358068 1.116019
O  -5.667935 2.214607 0.17383
O  6.276411 -2.336242 -1.168185
O  5.672608 2.219327 -0.140327
N  -5.659684 -0.084116 0.785538
N  5.658822 -0.067796 -0.794139
C  -0.715027 -0.298864 -0.292289
C  0.714918 -0.300721 0.286527
C  -1.79781 -0.140884 0.79479
C  1.796687 -0.124318 -0.798834
C  -3.226071 -0.279768 0.226633
C  3.225759 -0.268447 -0.234113
C  -4.296851 -0.146471 1.332984
C  4.294814 -0.118073 -1.339905
C  -6.547446 -1.19838 0.71287
C  -6.240572 1.097496 0.241675
C  6.54485 -1.184672 -0.744194
C  6.242999 1.102611 -0.229883
C  -7.800697 -0.673297 0.078578
C  -7.617256 0.703044 -0.20295
C  7.800386 -0.673561 -0.103102
C  7.619907 0.697578 0.204465
C  -9.000992 -1.329798 -0.229981
C  -8.628512 1.468416 -0.801629
C  9.00028 -1.337691 0.190273
C  8.633816 1.449904 0.815092
C  -10.031053 -0.564169 -0.837172
C  -9.847774 0.813403 -1.118298
C  10.033044 -0.585268 0.80925
C  9.852691 0.787064 1.116638
H  -0.807362 0.528785 -1.025108
H  -0.895657 -1.239909 -0.850315
H  0.898533 -1.248881 0.831384
H  0.80507 0.51696 1.030686
H  -1.637859 -0.882892 1.600608
H  1.637705 -0.8548 -1.61529
H  -3.38933 0.505684 -0.538702
H  -3.329609 -1.259145 -0.278086
H  3.388693 0.506402 0.541981
H  3.331503 -1.254718 0.256563
H  -4.10806 0.773173 1.913399
H  -4.25997 -1.014166 2.015308
H  4.106665 0.811503 -1.904477
H  4.25494 -0.974054 -2.036713
H  -1.830482 1.882577 0.860466
H  1.82342 1.899946 -0.834398
H  -9.131297 -2.39344 -0.00731
H  -8.475898 2.531289 -1.013563
H  9.128271 -2.397176 -0.052647
H  8.483495 2.508865 1.047286
H  -10.982604 -1.042296 -1.093111
H  -10.660567 1.378472 -1.586991
H  10.984398 -1.069649 1.053912
H  10.66748 1.341913 1.594001
