program: Gaussian 09
title: 000181349
version: EM64L-G09RevD.01
frameworkgroup: C1[X(C11H7ClF6O2)]
method: RPBEPBE
basis: SDD
operation: Freq
keyword: #p
keyword: freq=noraman
keyword: PBEPBE/SDD
title: #p freq=noraman PBEPBE/SDD
converged: YES YES NO NO
title: Mulliken charges:
elementType: Cl F F F F F F O O C C C C C C C C C C C H H H H H H H
charge: -0.040522 -0.139665 -0.140954 -0.142509 -0.132235 -0.146269 -0.140532 -0.386949 -0.230335 -0.381360 -0.374624 0.491523 0.391711 0.385652 0.180237 -0.347033 -0.398635 -0.215716 -0.199633 -0.117756 0.351706 0.310338 0.264477 0.247335 0.259501 0.260972 0.391274
chargesum: 0.00000
title: Mulliken charges with hydrogens summed into heavy atoms:
elementType: Cl F F F F F F O O C C C C C C C C C C C
charge: -0.040522 -0.139665 -0.140954 -0.142509 -0.132235 -0.146269 -0.140532 0.004325 -0.230335 -0.029655 -0.064286 0.491523 0.391711 0.385652 0.180237 -0.082556 -0.151300 0.043786 0.061339 -0.117756
polarizability: 1.81387992e+02 -1.54324240e+01 1.01809881e+02 1.13434823e+00 -6.20300174e+00 1.18838502e+02
1716.lowfreq: -3.9582 -2.2165 -0.0018 -0.0006 0.0009 7.8208 27.7763 37.2284 48.8541
frequency: 27.7287 37.2233 48.8409 51.5952 72.0030 78.5002 118.5471 123.2094 143.2786 157.6835 167.7675 196.3123 243.4234 270.5816 276.8106 293.1531 304.5291 331.8523 346.8567 395.3633 409.0135 436.7967 462.8370 464.4628 480.0312 502.1255 557.0577 574.9659 604.6348 608.3574 633.0059 636.9505 655.2464 710.3143 727.3714 792.3904 806.0764 830.3098 835.8874 853.0568 905.3127 953.9526 959.4123 973.6682 1000.6691 1016.7808 1024.8689 1055.1377 1076.1852 1078.1830 1094.6571 1116.8215 1177.6302 1189.5389 1191.4291 1193.2961 1227.1172 1255.5363 1295.7725 1312.9870 1339.8877 1362.7648 1384.0173 1407.4922 1477.9524 1588.2324 1599.8603 1652.3472 3045.2076 3072.8143 3140.5794 3143.8104 3173.2079 3177.2614 3516.9275
redmass: 13.2804 11.1027 15.4916 5.6753 10.0141 9.1872 9.3601 11.1607 9.5859 13.2694 12.8082 12.0824 10.8718 15.5443 13.5203 10.6325 18.1113 6.2938 5.5901 9.4516 2.8829 12.2190 11.8089 17.5160 14.3179 3.3913 2.7430 3.7256 5.4610 4.3289 5.9527 6.4672 2.9452 5.0683 4.5332 4.6404 6.1547 1.3788 1.5421 4.7742 3.9472 4.2112 1.6552 1.3983 4.6053 9.1382 6.9698 3.0117 2.9084 3.1300 7.8230 1.4560 5.7737 3.5730 2.8184 1.2654 1.4270 1.5625 1.4040 1.5296 1.6016 1.7047 5.7083 2.2744 2.3506 7.2829 6.1534 8.7757 1.0833 1.0850 1.0902 1.0905 1.0954 1.0963 1.0642
irintensity: 0.1983 0.3012 0.5903 0.1905 0.0578 2.1627 1.5892 1.0485 0.4123 1.7822 1.0612 0.5702 1.3148 0.4519 0.8735 0.8454 0.4673 2.4623 1.5226 12.4861 0.0693 7.6772 7.8338 4.7177 1.5504 10.1200 75.2913 72.8199 13.2580 65.9965 4.3935 31.6371 24.4844 34.8157 28.4414 66.6681 30.7544 9.6661 14.9422 11.9064 17.9530 97.7084 25.8442 3.3521 52.4752 3.6159 57.8539 433.5193 51.5266 120.8005 103.5819 9.8762 253.1049 141.3557 14.3675 16.9370 38.9862 71.9962 40.3128 45.4010 30.2014 66.4857 1.8271 9.1350 74.9427 0.3588 19.7879 191.8577 8.2925 1.1607 0.8822 5.0341 2.0296 0.8923 47.6813
temp: 298.150 k
press: 1.00000 atm
elementType: 17 9 9 9 9 9 9 8 8 6 6 6 6 6 6 6 6 6 6 6 1 1 1 1 1 1 1
symmnumber: 1
zpe: 433332.1 jmol-1
zpe.correction: 0.165047 hartree
zpe.thermalcorrener: 0.183812 hartree
zpe.thermalcorrenthalpy: 0.184756 hartree
zpe.thermalcorrgfe: 0.116083 hartree
zpe.sumelectzpe: -1631.467157 hartree
zpe.sumelectthermal: -1631.448393 hartree
zpe.sumelectthermalent: -1631.447449 hartree
zpe.sumelectthermalfe: -1631.516122 hartree
dipole: 1.1074 2.7209 0.7027
dipole: 3.0205
quadrupole: -135.2219 -117.8270 -116.1369
quadrupole: -1.8509 0.2027 1.0814
quadrupole: -12.1600 5.2349 6.9251 -1.8509 0.2027 1.0814
hfenergy: -1631.6322047 hartree
pointgroup: C01 [X(C11H7Cl1F6O2)]
dipole: -0.4529561 -1.0968938 0.061712 debye
polarizability: 180.9747685|-16.1771003|100.5713503|-3.5644418|2.4616684|120.490256 unknown
InChI: InChI=1S/C11H7ClF6O2/c12-6-3-1-5(2-4-6)7(9(19)20)8(10(13,14)15)11(16,17)18/h1-4,7-8,19H
charge 0 multiplicity 1
27 atoms
Cl -5.593703 0.539471 -0.01815
F  -0.058925 2.260938 -0.641863
F  2.053554 2.706946 0.00476
F  0.583668 1.851688 1.497836
F  3.813619 0.721658 -0.623646
F  3.157288 -1.325288 0.062359
F  3.099258 0.40702 1.512782
O  0.51351 -3.158147 0.228953
O  0.866796 -2.064974 -1.79335
C  1.409323 0.353294 -0.274879
C  0.434649 -0.751803 0.26138
C  -1.062838 -0.406567 0.173082
C  1.001346 1.779086 0.150446
C  2.861764 0.055717 0.16467
C  0.652523 -2.028016 -0.561996
C  -1.721944 -0.308798 -1.078434
C  -1.805963 -0.218807 1.362641
C  -3.100275 -0.017594 -1.143606
C  -3.186835 0.07074 1.313885
C  -3.813293 0.168265 0.057077
H  1.401553 0.324304 -1.380319
H  0.680144 -0.972246 1.313324
H  -1.168323 -0.466263 -2.010819
H  -1.309905 -0.291235 2.336445
H  -3.609561 0.061069 -2.108119
H  -3.760074 0.217726 2.233232
H  0.603145 -3.977983 -0.329088
