program: Gaussian 09
title: 000181367
version: EM64L-G09RevD.01
frameworkgroup: C1[X(C17H23BrO)]
method: RPBEPBE
basis: SDD
operation: Freq
keyword: #p
keyword: freq=noraman
keyword: PBEPBE/SDD
title: #p freq=noraman PBEPBE/SDD
converged: YES YES NO NO
title: Mulliken charges:
elementType: Br O C C C C C C C C C C C C C C C C C H H H H H H H H H H H H H H H H H H H H H H H
charge: 0.005475 -0.290137 -0.038596 0.007420 -0.463673 -0.450619 -0.400998 -0.392621 -0.427092 -0.473145 -0.438866 -0.036519 0.419282 -0.602412 -0.317606 -0.423484 -0.192038 -0.170405 -0.216726 0.203152 0.196332 0.214329 0.195333 0.187766 0.211525 0.192444 0.199587 0.194813 0.202738 0.202368 0.227403 0.211813 0.197541 0.236172 0.190429 0.212945 0.213352 0.216948 0.254263 0.236821 0.253797 0.250888
chargesum: 0.00000
title: Mulliken charges with hydrogens summed into heavy atoms:
elementType: Br O C C C C C C C C C C C C C C C C C
charge: 0.005475 -0.290137 0.164556 0.203752 -0.054010 -0.051328 -0.008967 0.004930 0.002679 -0.063791 -0.012265 0.176426 0.419282 -0.172111 -0.063343 -0.186664 0.061759 0.080483 -0.216726
polarizability: 2.26689386e+02 -1.11933905e+01 2.16243572e+02 1.85894210e+01 -1.07812537e+01 1.50513404e+02
1716.lowfreq: -9.6834 -5.1581 -0.0007 -0.0001 0.0006 3.8498 11.2408 18.8362 33.4057
frequency: 9.7499 18.6404 33.3599 51.6176 56.0218 69.6331 78.1172 97.2631 121.9086 141.8434 177.7932 213.3315 227.5620 248.4051 263.3748 281.0171 306.0539 338.6880 349.1107 376.4652 406.5834 417.7633 423.4033 443.7925 479.8883 487.3559 529.4465 534.8199 620.5789 630.1263 642.3358 710.3024 764.9379 778.1993 787.6585 820.4375 829.9917 833.6932 837.5134 882.0035 886.5514 915.8217 936.8089 940.8712 949.4784 955.5636 971.9078 973.4083 989.2299 1001.0007 1006.4418 1016.7472 1035.4225 1046.4768 1053.2467 1058.3883 1076.9622 1095.5624 1109.0153 1110.2881 1133.8773 1157.5141 1182.8106 1191.5660 1201.6357 1208.5337 1225.6636 1245.5460 1248.4848 1260.1446 1275.3742 1286.7161 1291.9983 1295.3580 1300.0722 1313.0163 1325.8488 1331.0040 1336.4073 1337.2323 1341.7188 1346.8782 1364.0175 1377.8696 1391.2952 1424.8150 1457.3151 1461.0575 1463.0543 1463.8652 1467.5630 1473.0313 1473.6915 1475.0093 1582.0786 1595.3678 1657.8666 2927.1225 2948.5438 2949.9911 2960.3375 2963.7893 2968.5893 2969.2070 2972.1148 2976.8290 3019.5799 3029.4979 3030.0940 3035.8268 3038.6511 3044.7913 3048.2375 3070.7036 3089.0463 3125.2291 3145.3302 3167.5824 3170.8720 3192.4845
redmass: 5.3496 5.4668 3.7532 3.1945 2.4572 3.0957 3.0451 4.1079 3.9395 3.2999 2.1551 4.0127 5.3676 4.5336 3.1771 5.3659 1.7918 2.4592 2.5652 3.1888 2.8801 3.4379 2.6013 2.7626 2.9502 2.8753 3.6436 1.7498 6.0572 5.3891 1.5329 3.8016 1.4565 1.8610 2.6190 2.1065 1.6912 1.6527 1.3118 2.3598 1.6637 1.9552 1.5796 1.6732 1.3958 2.5779 1.5029 1.3814 3.4366 3.0998 1.1530 3.3895 2.9939 1.6761 1.3746 2.5689 1.7255 1.9102 2.1384 1.4729 1.9819 2.0865 1.1121 1.4738 2.4906 1.6743 1.2129 1.2741 1.3388 1.2295 1.2102 1.2595 1.2472 1.2760 1.1913 1.1872 1.3809 1.4774 1.5178 1.4396 1.4409 1.5215 1.5363 5.1938 2.3129 1.1781 1.0901 1.0914 1.1020 1.3929 1.1109 1.1261 1.4672 1.0974 7.2761 6.1070 4.7232 1.0816 1.0659 1.0733 1.0682 1.0637 1.0620 1.0623 1.0657 1.0614 1.0943 1.0966 1.0982 1.0987 1.0984 1.1029 1.0988 1.0794 1.0745 1.0897 1.0885 1.0951 1.0965 1.1144
irintensity: 0.0487 0.3739 0.1075 0.0454 0.0149 0.0799 0.4573 0.2034 0.3261 1.6279 0.4293 1.2457 2.6887 0.3158 0.5837 9.5353 0.2356 1.5041 0.3610 8.6297 0.5323 6.1175 3.0948 5.2662 1.5172 24.3650 5.5240 3.8713 3.2837 4.7637 17.0484 1.9704 2.6599 7.6557 26.6509 20.7544 45.1577 5.5544 12.4670 10.5025 3.0823 8.8010 54.2449 31.9272 2.4740 0.6997 2.5605 0.1773 108.6003 24.7887 15.5901 87.2131 23.0846 8.3379 5.0264 30.1501 0.6169 2.3066 3.9803 3.6212 2.3058 2.5601 1.2733 0.4942 3.6856 9.3006 6.4473 3.1071 2.4007 3.1887 1.6181 0.7893 2.2929 4.6192 0.2590 2.9345 8.8630 7.4435 4.9489 0.8156 0.1869 5.1086 2.5078 1.8847 9.9317 3.2830 4.5815 5.5614 8.2633 26.5693 29.7121 20.6823 22.2752 8.0564 1.7301 20.1951 23.5357 13.7112 16.9789 3.0058 30.1104 32.0269 26.6047 35.6751 77.6393 63.0024 3.9911 65.6726 69.7720 6.6048 12.5460 102.2879 46.1857 43.6470 7.5068 10.7274 2.6405 9.5859 0.3866 31.7673
temp: 298.150 k
press: 1.00000 atm
elementType: 35 8 6 6 6 6 6 6 6 6 6 6 6 6 6 6 6 6 6 1 1 1 1 1 1 1 1 1 1 1 1 1 1 1 1 1 1 1 1 1 1 1
symmnumber: 1
zpe: 934640.7 jmol-1
zpe.correction: 0.355986 hartree
zpe.thermalcorrener: 0.375648 hartree
zpe.thermalcorrenthalpy: 0.376592 hartree
zpe.thermalcorrgfe: 0.303455 hartree
zpe.sumelectzpe: -748.813143 hartree
zpe.sumelectthermal: -748.793481 hartree
zpe.sumelectthermalent: -748.792537 hartree
zpe.sumelectthermalfe: -748.865674 hartree
dipole: 1.2570 -2.1593 -0.0980
dipole: 2.5004
quadrupole: -133.7155 -118.4715 -125.5476
quadrupole: 0.0548 -4.1574 0.0363
quadrupole: -7.8040 7.4401 0.3639 0.0548 -4.1574 0.0363
hfenergy: -749.1691285 hartree
pointgroup: C01 [X(C17H23Br1O1)]
dipole: 0.3161417 0.9308675 0.0358498 debye
polarizability: 194.2149969|10.9610204|225.2244304|-37.4518209|-10.2064888|174.0069342 unknown
InChI: InChI=1S/C17H23BrO/c1-2-3-6-15-7-4-5-8-17(15)19-13-14-9-11-16(18)12-10-14/h2,9-12,15,17H,1,3-8,13H2
charge 0 multiplicity 1
42 atoms
Br -4.173169 -2.427079 3.158593
O  0.022033 1.220072 -1.182511
C  2.283542 0.625884 -0.530452
C  0.985662 1.323511 -0.056005
C  3.376987 0.763786 0.565138
C  1.231749 2.797529 0.333598
C  3.627424 2.233057 0.976908
C  2.316555 2.912627 1.43108
C  2.021317 -0.851426 -0.918749
C  3.241569 -1.560154 -1.567231
C  -1.367875 1.563605 -0.853704
C  2.877238 -2.911039 -2.146466
C  -2.023236 0.604879 0.134768
C  3.441064 -4.096325 -1.801756
C  -1.867225 -0.797003 -0.013711
C  -2.822859 1.090461 1.196937
C  -2.496132 -1.697931 0.872398
C  -3.466599 0.204925 2.093559
C  -3.29238 -1.181685 1.91694
H  2.626654 1.168268 -1.439063
H  0.576866 0.77004 0.820443
H  4.319536 0.310317 0.205265
H  3.064727 0.180622 1.457788
H  0.292762 3.266636 0.686604
H  1.553172 3.346915 -0.573987
H  4.047199 2.790131 0.114009
H  4.382746 2.276651 1.785359
H  1.954573 2.427524 2.361281
H  2.493496 3.977776 1.674594
H  1.703978 -1.421877 -0.021046
H  1.174698 -0.873292 -1.630557
H  4.061726 -1.683368 -0.835098
H  3.628357 -0.906551 -2.379106
H  -1.877703 1.515825 -1.833644
H  -1.449784 2.605679 -0.481103
H  2.077867 -2.901483 -2.905685
H  3.12546 -5.040312 -2.260639
H  4.236926 -4.154842 -1.048303
H  -1.237833 -1.181816 -0.823603
H  -2.95038 2.171258 1.33437
H  -2.369148 -2.777576 0.751432
H  -4.082759 0.589576 2.91136
