program: Gaussian 09
title: 000181307
version: EM64L-G09RevD.01
frameworkgroup: C1[X(C8H14O2)]
method: RPBEPBE
basis: SDD
operation: Freq
keyword: #pfreq=noraman
keyword: PBEPBE/SDD
title: #p freq=noraman PBEPBE/SDD
converged: YES YES NO NO
title: Mulliken charges:
elementType: O O C C C C C C C C H H H H H H H H H H H H H H
charge: -0.417216 -0.233111 -0.138218 -0.180122 -0.453712 -0.204205 -0.688781 -0.687946 -0.474123 0.183891 0.204198 0.233509 0.225964 0.225030 0.225307 0.224220 0.205484 0.213151 0.226546 0.205633 0.212610 0.265325 0.251109 0.375458
chargesum: 0.00000
title: Mulliken charges with hydrogens summed into heavy atoms:
elementType: O O C C C C C C C C
charge: -0.041758 -0.233111 0.065979 0.053387 -0.002718 0.021102 -0.045926 -0.043156 0.042310 0.183891
polarizability: 1.29473293e+02 -1.53516849e+00 8.26465834e+01 4.58819679e+00 3.01166872e+00 7.38507543e+01
1716.lowfreq: -11.3326 -0.0007 0.0000 0.0005 4.1002 8.6091 17.2080 36.6999 66.1070
frequency: 16.3059 36.6069 66.0568 70.8476 107.6143 178.0352 189.9252 204.1235 243.7254 259.4465 343.4717 388.3408 435.7884 484.0708 493.5228 506.9823 592.4866 638.8301 765.5513 818.6894 841.0967 866.6015 914.7959 933.6128 951.6196 975.1147 994.6261 1020.2012 1076.2693 1086.1123 1108.1041 1130.8636 1171.1784 1193.0611 1232.9814 1254.6050 1269.0228 1289.2341 1299.6499 1302.1153 1346.9547 1367.8081 1371.6182 1389.8188 1437.7342 1464.8613 1465.5505 1467.2303 1478.4228 1485.4723 1668.3392 1685.1945 2969.0298 2971.8798 2979.1142 2985.8887 2996.2551 3038.6226 3053.0212 3057.5817 3060.9551 3068.5385 3072.1933 3076.5144 3081.3254 3510.1609
redmass: 5.5707 3.5945 3.3929 2.5799 2.4867 3.5777 1.7668 1.1383 1.5365 1.9403 2.3864 3.2376 2.4526 3.0644 3.1035 1.9053 4.3089 1.3225 1.3926 2.0374 2.1651 3.6625 1.1805 1.9215 1.4186 1.1247 1.9006 2.9054 2.4647 2.4170 2.5029 1.4383 1.7680 1.7215 1.3783 1.3607 1.1786 1.3977 1.3449 1.3641 1.5260 1.7432 1.2088 1.2094 1.0822 1.0833 1.0492 1.0535 1.0479 1.0556 8.2365 6.7261 1.0349 1.0353 1.0843 1.0624 1.0623 1.0951 1.0931 1.0934 1.0998 1.0991 1.0941 1.1004 1.0995 1.0639
irintensity: 0.7085 0.0788 0.3841 0.3302 0.2367 2.8631 0.8349 0.3645 0.6453 0.0390 0.9513 5.8681 2.2970 17.3208 15.8526 33.7945 12.8214 129.3633 13.5120 2.2440 1.3598 4.1473 0.9871 11.9991 1.0838 57.7803 4.5909 181.2197 125.3730 3.5453 7.9368 1.2622 2.3044 8.1907 1.0483 0.5530 1.7574 20.3697 15.1138 3.3570 12.3272 40.7235 19.2470 8.1599 27.8150 16.4023 0.7296 7.6432 11.8586 18.1416 217.4271 0.3874 32.9376 40.7821 14.2826 11.4608 15.6979 1.1141 1.4749 3.5313 0.7980 45.6851 121.0645 29.6606 52.0800 16.9266
temp: 298.150 k
press: 1.00000 atm
elementType: 8 8 6 6 6 6 6 6 6 6 1 1 1 1 1 1 1 1 1 1 1 1 1 1
symmnumber: 1
zpe: 534140.8 jmol-1
zpe.correction: 0.203443 hartree
zpe.thermalcorrener: 0.215839 hartree
zpe.thermalcorrenthalpy: 0.216783 hartree
zpe.thermalcorrgfe: 0.162659 hartree
zpe.sumelectzpe: -462.886319 hartree
zpe.sumelectthermal: -462.873923 hartree
zpe.sumelectthermalent: -462.872979 hartree
zpe.sumelectthermalfe: -462.927103 hartree
dipole: -0.7493 1.3427 0.5569
dipole: 1.6354
quadrupole: -56.9051 -67.8383 -59.8493
quadrupole: 4.6637 1.1126 -1.4452
quadrupole: 4.6258 -6.3074 1.6817 4.6637 1.1126 -1.4452
hfenergy: -463.0897626 hartree
pointgroup: C01 [X(C8H14O2)]
dipole: -0.2964883 0.5318335 0.2079178 debye
dipolederiv: -0.8918424 -0.5487081 -0.1241344 -0.5305763 -0.8037969 -0.0376998 -0.0701264 -0.0164403 -0.4217293 -0.7211937 0.1885427 0.0960352 -0.0670974 -0.9009176 -0.1637038 0.0622646 -0.208885 -0.3693618 0.0741706 0.0196232 0.0096892 0.0004768 0.1546822 -0.0089508 -0.0956518 0.0027126 0.1232111 0.1077014 -0.0879426 0.0342964 -0.1013799 -0.2559941 0.0806097 -0.0547439 0.1020712 0.0987587 0.0093079 0.0228792 0.0275899 0.0531954 0.133607 -0.0541488 -0.0521073 -0.0250002 0.1006073 0.0686474 -0.0795461 -0.0071601 -0.171339 -0.2343804 0.0663358 -0.091568 0.0692935 0.1150922 -0.0466968 0.0300918 -0.031964 0.0045477 -0.0354905 0.0561083 0.0586721 0.0336586 0.0889572 -0.0565467 -0.0493013 -0.0240424 0.0271903 -0.0280863 0.010968 0.0480595 0.0080055 0.1030472 -0.3276975 0.0653818 0.0797511 0.2550164 -0.0389543 -0.070782 0.209809 -0.0730646 0.1180851 1.4539182 0.2054644 -0.1076627 0.2968005 1.3812838 0.3029918 -0.1623962 0.3174154 0.2957451 0.0284202 -0.0114306 -0.0533394 0.0003778 0.016638 -0.0320511 0.0008554 -0.0414039 -0.1823343 0.0312641 0.0280311 0.0137651 0.0362126 0.1314257 -0.0604736 0.0478213 -0.0646044 -0.1190259 -0.0113974 0.062723 -0.041566 0.0497336 -0.0553153 0.0783313 -0.0167679 0.08418 0.0465429 0.0478098 -0.0177563 -0.0306783 -0.0269385 0.0629837 -0.0292595 0.020029 -0.0587239 -0.1227291 0.0295728 0.0274008 0.0321123 0.0568798 0.1287342 -0.0684869 0.0415601 -0.0600167 -0.1245948 0.0169426 -0.1471539 -0.024857 -0.1145144 -0.0949319 -0.0087818 -0.0300547 -0.0264599 0.0761301 0.1009323 0.0117292 0.0062485 -0.0076828 0.0598657 -0.0803358 -0.0237497 -0.0042022 -0.1666745 -0.1926885 0.1054395 0.0522952 0.0985369 0.0551312 0.0102363 0.0655587 -0.0099903 0.0548174 0.0899021 0.0622259 -0.0460467 0.0269477 -0.1150494 0.0950025 -0.0305373 0.1098389 0.0296993 0.0920444 -0.0149965 0.0216935 -0.016372 0.065165 -0.020605 -0.040133 -0.0796773 -0.1632354 -0.2193619 0.0245739 0.0607296 0.045938 0.0634313 -0.0404055 0.0747704 -0.0264149 0.0669588 0.078187 0.0226764 -0.0069537 -0.0268955 -0.0309591 0.0723875 -0.0204037 0.088948 0.0619076 0.0810566 -0.0044758 0.0026776 -0.0234318 0.089707 -0.0350351 -0.0218822 -0.0667901 -0.0709374 0.1575473 0.0845283 0.061521 0.1343739 0.251221 -0.0622516 0.0807221 -0.05445 0.3610624 unknown
polarizability: 129.3616961|-1.5512956|82.7381719|5.2252523|2.8565256|73.8707626 unknown
InChI: InChI=1S/C8H14O2/c1-7(2)5-3-4-6-8(9)10/h3,5,7,9H,4,6H2,1-2H3
charge 0 multiplicity 1
24 atoms
O  4.100134 1.089025 0.123151
O  3.583614 -1.103951 -0.43648
C  -3.127659 0.183515 0.231613
C  -1.736431 -0.20333 -0.238279
C  0.7504 -0.680005 0.072918
C  -0.631145 -0.279124 0.547562
C  -3.61721 1.463737 -0.497357
C  -4.12522 -0.984801 0.008054
C  1.792763 0.432412 0.334232
C  3.202807 0.01823 -0.03808
H  -3.080599 0.398029 1.318876
H  -1.646374 -0.443158 -1.311739
H  1.084361 -1.600575 0.59147
H  0.729352 -0.922651 -1.005223
H  -0.726578 -0.040166 1.620134
H  -2.937056 2.314253 -0.311329
H  -3.663208 1.297201 -1.590828
H  -4.630673 1.746884 -0.156144
H  -3.803474 -1.893003 0.548288
H  -4.197479 -1.23613 -1.067625
H  -5.137453 -0.709435 0.359335
H  1.539957 1.353327 -0.223933
H  1.799082 0.724276 1.403279
H  5.016288 0.784839 -0.122198
