program: Gaussian 09
title: 000181288
version: EM64L-G09RevD.01
frameworkgroup: C1[X(C8H13NO)]
method: RPBEPBE
basis: SDD
operation: Freq
keyword: #p
keyword: freq=noraman
keyword: PBEPBE/SDD
title: #p freq=noraman PBEPBE/SDD
converged: YES YES NO NO
title: Mulliken charges:
elementType: O N C C C C C C C C H H H H H H H H H H H H H
charge: -0.272621 -0.604865 -0.140735 -0.512354 -0.518289 0.154841 -0.042094 -0.022867 -0.617599 -0.592387 0.237563 0.232526 0.222469 0.253313 0.217671 0.236582 0.218373 0.339217 0.326369 0.222047 0.229326 0.219557 0.213959
chargesum: 0.00000
title: Mulliken charges with hydrogens summed into heavy atoms:
elementType: O N C C C C C C C C
charge: -0.272621 0.060720 0.096828 -0.057359 -0.047305 0.154841 0.194488 0.195506 -0.166226 -0.158871
polarizability: 1.10448534e+02 -7.66713630e-01 1.04575707e+02 4.27304252e-01 -9.13292046e+00 7.13617099e+01
1716.lowfreq: -11.6183 -2.4759 -0.0006 -0.0005 -0.0002 15.3563 33.8742 62.6803 73.3523
frequency: 33.4825 62.5159 73.3221 105.2210 129.7802 163.3180 224.0816 251.4833 306.5530 351.0070 383.4868 408.6463 520.0104 541.8681 596.3860 625.5395 634.6151 685.9461 720.2287 782.3247 855.5422 908.0262 925.4101 938.0372 942.0687 953.0470 986.3416 1008.8500 1016.7290 1070.8018 1088.8930 1095.2139 1149.4010 1207.3976 1220.3950 1257.2829 1283.7640 1291.9362 1299.8253 1318.0199 1338.9534 1363.9780 1426.1415 1427.2992 1453.4679 1465.7560 1586.5118 1633.2074 1645.2607 1657.2825 2970.3864 2980.2604 3002.6736 3036.7046 3041.7450 3071.2518 3081.0253 3088.2778 3100.8736 3191.6211 3193.4013 3459.0608 3632.0000
redmass: 4.2448 3.7524 2.4885 2.4309 3.2443 3.1807 2.6268 2.6098 3.0627 3.0634 2.3799 2.0683 2.2732 1.8119 1.4401 1.4299 1.2102 1.8684 2.9778 2.7789 2.1530 1.6671 1.6428 2.2206 1.3578 1.3773 1.6120 1.1560 1.1798 1.6098 1.6441 3.1392 2.1509 1.3058 1.3291 1.2686 1.2973 1.2574 1.2684 1.3935 1.3984 2.9904 1.1819 1.1759 1.1130 1.0980 1.6682 2.7123 4.5082 4.7307 1.0624 1.0600 1.0837 1.0977 1.0985 1.0801 1.0602 1.0741 1.0930 1.1140 1.1142 1.0483 1.1020
irintensity: 5.1246 2.6543 0.1051 0.1463 1.9353 1.8331 2.6331 1.0321 5.6681 7.4217 0.7973 0.8352 2.2309 15.7594 84.9211 99.6721 53.9135 20.2957 8.6550 2.1919 9.2457 9.8181 3.2929 39.4525 67.4979 73.8731 3.0977 8.5778 26.9104 8.0707 9.6222 3.3938 3.4502 16.9240 7.4816 2.0192 3.9739 2.7948 2.9639 0.7716 10.5229 82.0254 5.6688 3.7868 21.9021 19.6445 132.4009 227.7154 27.5028 17.0534 16.3813 10.6463 13.6099 17.5201 15.4388 32.7904 11.2993 5.0682 11.7893 21.2746 30.7114 91.1454 82.1478
temp: 298.150 k
press: 1.00000 atm
elementType: 8 7 6 6 6 6 6 6 6 6 1 1 1 1 1 1 1 1 1 1 1 1 1
symmnumber: 1
zpe: 509991.6 jmol-1
zpe.correction: 0.194246 hartree
zpe.thermalcorrener: 0.205793 hartree
zpe.thermalcorrenthalpy: 0.206737 hartree
zpe.thermalcorrgfe: 0.155977 hartree
zpe.sumelectzpe: -441.811528 hartree
zpe.sumelectthermal: -441.799980 hartree
zpe.sumelectthermalent: -441.799036 hartree
zpe.sumelectthermalfe: -441.849796 hartree
dipole: 0.3621 3.8400 -0.3777
dipole: 3.8755
quadrupole: -57.7481 -72.2601 -58.4825
quadrupole: -7.5796 3.0627 -1.9581
quadrupole: 5.0821 -9.4298 4.3477 -7.5796 3.0627 -1.9581
hfenergy: -442.0057733 hartree
pointgroup: C01 [X(C8H13N1O1)]
dipole: 0.7803397 -1.2780384 0.2872675 debye
dipolederiv: -0.8323905 0.3993469 -0.0729494 0.1996413 -0.8931677 0.1711761 0.037759 0.1072745 -0.4158274 -0.5150763 -0.2163765 0.0232649 -0.1030368 -0.9694174 0.1231431 0.012948 0.2052981 -0.6523137 -0.2326115 -0.0365337 0.0182145 -0.1230208 0.1996703 0.0089406 0.0753043 0.0407229 0.1205939 0.0338755 -0.0679476 0.0207494 0.0132469 -0.100662 0.0630035 -0.0221724 0.0750301 0.0213995 -0.0960269 -0.0200209 0.0381024 0.1283915 0.125404 -0.019618 0.1018617 0.0120702 0.0718635 1.0712233 -0.1418328 -0.0883389 -0.0963886 1.2878698 -0.4718787 -0.2797846 -0.5044676 0.3353838 -0.105209 0.1931785 0.1135549 0.1186127 0.1413959 -0.100017 0.1326278 -0.2545484 0.0922139 0.3042857 0.0778918 0.0267595 -0.0120636 -0.1362057 -0.1502843 -0.1564971 -0.1974579 0.0593742 -0.3261532 0.0499426 0.2296199 0.0831057 -0.2043425 0.0010873 0.2213255 0.0097075 -0.0092661 -0.1886752 0.0112521 -0.0781934 0.0435883 -0.3450763 -0.1873002 -0.0848067 -0.2027078 -0.0195932 0.0651131 0.0293513 0.0072173 0.0257371 -0.0338767 0.0874109 0.0163615 0.0604263 -0.0671045 -0.0797136 0.0204903 0.0811669 0.0013593 0.0615068 0.06809 0.0727534 0.0997169 0.0421573 0.0255837 -0.0434712 -0.1154403 -0.0638676 -0.0482317 -0.09757 -0.0785474 -0.0367013 -0.0300343 0.0169393 0.0858465 0.0094936 0.0244491 -0.063553 -0.0431266 0.0455878 -0.0012526 0.0935209 0.0237265 -0.0283511 -0.0415396 -0.0348611 0.0379914 0.1083629 0.0069952 0.0853785 -0.1001962 0.0616038 -0.0624222 -0.0999883 -0.0647322 0.0636862 -0.0512682 -0.0985573 -0.0169548 -0.0345974 0.0347986 -0.0048335 -0.0171039 -0.0054448 0.1054227 0.099794 0.0495775 0.1226157 -0.0877978 0.3568961 -0.131851 0.006975 -0.0745606 0.2102748 0.0720071 0.0143718 0.0645257 0.2747237 0.1503873 0.0497217 0.0518979 0.0387073 0.1868702 0.0563061 0.0654644 0.0722762 0.3161489 0.1495397 0.0010731 -0.0860147 -0.0009955 0.0110373 0.0910666 -0.0817121 0.117489 -0.0103813 0.1037033 -0.0734677 -0.1117837 -0.0504112 0.0684043 -0.0178144 -0.1272315 -0.0527696 -0.0125717 -0.1033219 -0.071531 0.0456919 -0.0428976 0.1637006 0.0631778 0.0713649 0.0680472 0.0761557 0.0815019 -0.0194557 0.0386439 -0.0045587 0.1312988 0.1253114 0.0050064 0.1262813 -0.0638516 unknown
polarizability: 107.7543056|3.8902574|105.3702154|6.6860882|-9.8748817|73.2614294 unknown
InChI: InChI=1S/C8H13NO/c1-3-5-7(6-4-2)8(9)10/h3-4,7H,1-2,5-6,9H2
charge 0 multiplicity 1
23 atoms
O  -2.568237 1.465232 -0.536994
N  -2.260087 -0.693793 0.25156
C  -0.335144 0.505502 -0.807893
C  0.341501 -0.864353 -1.124038
C  0.462932 1.378212 0.219569
C  -1.813062 0.45997 -0.364613
C  0.63543 -1.770521 0.055552
C  1.860969 1.707176 -0.257333
C  0.247276 -3.069444 0.157783
C  3.005771 1.486654 0.43706
H  -0.359108 1.079632 -1.755671
H  1.312374 -0.627111 -1.605966
H  -0.262838 -1.408912 -1.874567
H  -0.111693 2.316781 0.352307
H  0.499331 0.881406 1.207202
H  1.240215 -1.332753 0.863587
H  1.922597 2.18192 -1.250524
H  -1.642087 -1.489527 0.427002
H  -3.227287 -0.717816 0.575273
H  0.525748 -3.686916 1.019198
H  -0.335006 -3.559953 -0.633542
H  3.98516 1.773126 0.037762
H  2.995647 1.02509 1.432991
