program: Gaussian 09
title: 000181374
version: EM64L-G09RevD.01
frameworkgroup: C1[X(C22H24Cl2O2)]
method: RPBEPBE
basis: SDD
operation: Freq
keyword: #p
keyword: freq=noraman
keyword: PBEPBE/SDD
title: #p freq=noraman PBEPBE/SDD
converged: YES YES NO NO
title: Mulliken charges:
elementType: Cl Cl O O C C C C C C C C C C C C C C C C C C C C C C H H H H H H H H H H H H H H H H H H H H H H H H
charge: -0.053101 -0.064186 -0.320325 -0.193984 -0.012467 0.000985 -0.462625 -0.452044 -0.399570 -0.390835 -0.438269 -0.466811 -0.343625 0.552719 0.396872 -0.068916 -0.465336 -0.373892 -0.357956 -0.420894 -0.204718 -0.211895 -0.209855 -0.199607 -0.120478 -0.114626 0.201059 0.191196 0.195979 0.199704 0.204554 0.224122 0.202044 0.193681 0.207652 0.194463 0.208724 0.248389 0.234645 0.238709 0.223879 0.170479 0.245494 0.244240 0.260240 0.285215 0.256561 0.254789 0.257073 0.252549
chargesum: 0.00000
title: Mulliken charges with hydrogens summed into heavy atoms:
elementType: Cl Cl O O C C C C C C C C C C C C C C C C C C C C C C
charge: -0.053101 -0.064186 -0.320325 -0.193984 0.188593 0.192182 -0.066942 -0.023367 -0.003845 0.011279 0.018844 0.006543 -0.119746 0.552719 0.396872 0.101563 -0.219842 -0.129653 -0.097715 -0.135679 0.051843 0.042894 0.047219 0.052941 -0.120478 -0.114626
polarizability: 2.62363555e+02 1.31124559e+01 3.03723614e+02 -5.79400464e+00 1.82044032e+01 2.07042095e+02
1716.lowfreq: -2.2789 -0.0017 -0.0017 -0.0004 6.1309 8.2063 14.9388 23.7472 26.1136
frequency: 14.7046 23.2203 25.6386 26.3790 30.0427 39.5492 50.6557 68.8514 73.7582 94.9967 112.2495 127.4441 145.7867 161.2868 166.0215 183.9168 205.0891 226.0156 247.8380 274.0542 285.0634 306.6876 318.0308 327.4257 340.2482 391.4391 403.5749 407.3650 411.2909 422.3028 437.5806 451.1737 468.3133 490.7578 512.0799 530.8750 585.8900 622.3244 625.8245 658.4113 660.3316 676.6137 692.9248 718.1055 727.3589 781.5949 793.3889 801.5528 820.4855 833.5298 834.8512 844.0194 848.6264 853.3788 873.4374 894.4570 905.4265 906.7268 938.5296 953.5048 959.5976 968.3263 971.3747 982.7991 995.5900 1000.9441 1001.2356 1012.7981 1051.2071 1060.3467 1070.5147 1071.6352 1072.3212 1096.1738 1105.1451 1107.9389 1113.6700 1128.3564 1149.1065 1174.5026 1177.7086 1181.0409 1185.3561 1202.2709 1209.5763 1236.9224 1244.1353 1262.5043 1267.2847 1274.9509 1282.2738 1290.3346 1294.2940 1304.3065 1315.0322 1318.1646 1326.3486 1337.6582 1341.8849 1346.3781 1353.1337 1362.8205 1374.3315 1378.8859 1382.9662 1388.9746 1399.7622 1425.1121 1463.5533 1464.8937 1471.1673 1471.4188 1474.3978 1474.8968 1477.0313 1585.8357 1588.2034 1596.1771 1601.0306 1644.3290 2853.0653 2923.8890 2942.0965 2950.3108 2953.3612 2962.9627 2969.4563 2970.3298 2983.3672 2986.9212 2991.5312 3023.3406 3032.9444 3040.2503 3054.8319 3055.7153 3123.7401 3132.2601 3143.4361 3160.5761 3169.6868 3170.9111 3172.6915 3185.2107
redmass: 7.7350 6.3188 6.4099 4.9462 5.5477 4.1089 4.6368 4.5291 3.5834 3.5462 5.8441 7.4282 5.2673 1.8298 4.6359 2.8770 7.2471 5.0518 4.5917 5.5059 4.6091 4.4052 2.0639 4.5344 3.7085 5.1589 3.2173 2.9369 3.2502 4.8076 3.2292 4.6954 3.7848 3.3838 3.0910 2.3652 3.5135 6.8455 7.0675 1.3255 5.6359 4.4142 3.1123 4.3670 3.7760 2.1394 2.1487 1.5470 1.8580 1.2843 1.3348 1.8384 1.8802 1.7045 2.2853 2.8779 2.3954 1.8771 2.1330 1.4586 1.3897 2.7434 1.4038 1.3472 3.3171 3.3933 2.2394 4.2584 1.3101 1.7881 2.7988 2.2384 2.6376 2.2921 1.3670 1.3449 2.4535 1.9045 2.2130 1.5315 1.5130 1.1580 1.7090 1.4545 2.0786 1.3350 1.3285 1.3175 1.4861 1.2246 1.3441 1.2644 1.2487 1.3920 1.2065 1.3723 1.4643 1.4584 1.5440 1.5070 1.5643 1.5630 4.1719 1.2399 5.5000 3.6491 2.2842 1.1055 1.0875 1.0884 1.0818 1.0868 2.3961 2.4477 1.0950 7.6809 7.4590 6.2281 6.2801 7.4658 1.0841 1.0824 1.0812 1.0620 1.0718 1.0729 1.0666 1.0601 1.0716 1.0640 1.0859 1.0973 1.0964 1.1012 1.0998 1.1012 1.0900 1.0896 1.0893 1.0897 1.0949 1.0953 1.0962 1.0952
irintensity: 0.2163 1.3786 0.6261 0.9942 4.6964 0.0432 0.1645 1.5367 2.2093 1.2198 0.4360 0.5805 0.9830 1.5657 1.8331 0.9340 0.2582 0.8849 4.6601 12.5221 0.6461 0.6377 0.9995 2.7450 3.0968 12.6459 0.7033 0.2594 0.9167 0.5893 0.6787 5.2425 6.5421 26.0281 29.1371 27.4112 0.9859 1.1193 0.7224 11.4888 5.3909 5.9560 7.5581 3.0409 0.5553 17.0097 59.3976 2.0044 65.2707 1.4319 1.8257 18.0364 15.2233 17.4720 6.3905 16.7781 16.4817 5.1745 5.4690 4.5433 0.6886 0.6151 0.5550 0.8933 186.3464 49.4900 15.1993 117.3699 2.9503 1.1661 48.4287 4.9646 28.2270 1.1073 4.5775 13.0269 2.4084 0.9342 5.0481 3.8673 5.7982 2.7270 6.3916 9.0973 4.8644 8.0605 6.1585 22.4274 5.8906 3.7125 20.4084 11.5301 1.4159 2.5183 1.4551 14.8613 0.3639 0.9234 1.7559 4.1723 12.1735 4.0528 1.3363 6.1135 1.4431 6.0283 9.3567 27.1604 6.2169 6.8771 19.1466 8.6652 56.8907 100.9802 5.0951 3.3550 3.0712 21.8660 5.7175 109.1810 175.9234 21.6780 4.4301 32.9255 17.8760 41.3324 33.2606 31.0386 11.4868 24.0301 22.5497 71.5886 63.2866 47.6345 23.3449 63.3541 8.6757 8.0638 2.8135 1.9684 4.9446 3.9429 0.6700 2.2576
temp: 298.150 k
press: 1.00000 atm
elementType: 17 17 8 8 6 6 6 6 6 6 6 6 6 6 6 6 6 6 6 6 6 6 6 6 6 6 1 1 1 1 1 1 1 1 1 1 1 1 1 1 1 1 1 1 1 1 1 1 1 1
symmnumber: 1
zpe: 1055565.8 jmol-1
zpe.correction: 0.402044 hartree
zpe.thermalcorrener: 0.427310 hartree
zpe.thermalcorrenthalpy: 0.428254 hartree
zpe.thermalcorrgfe: 0.342035 hartree
zpe.sumelectzpe: -1921.382167 hartree
zpe.sumelectthermal: -1921.356900 hartree
zpe.sumelectthermalent: -1921.355956 hartree
zpe.sumelectthermalfe: -1921.442175 hartree
dipole: 4.7805 0.6118 -1.5185
dipole: 5.0531
quadrupole: -163.2264 -183.5693 -169.4312
quadrupole: -10.2068 -6.0868 9.6060
quadrupole: 8.8492 -11.4936 2.6444 -10.2068 -6.0868 9.6060
hfenergy: -1921.7842107 hartree
pointgroup: C01 [X(C22H24Cl2O2)]
dipole: 0.9729301 1.7124642 -0.2705318 debye
polarizability: 270.0490622|-15.4916279|283.0846152|-27.8221526|27.688747|219.9955866 unknown
InChI: InChI=1S/C22H24Cl2O2/c23-19-11-7-17(8-12-19)22(18-9-13-20(24)14-10-18)26-21-6-2-1-4-16(21)5-3-15-25/h7-16,21-22H,1-6H2
charge 0 multiplicity 1
50 atoms
Cl -5.76888 1.965212 1.817148
Cl -0.613738 -6.069239 -2.13459
O  0.435852 0.454951 -0.63778
O  4.628712 -1.081017 2.300535
C  2.412993 1.86252 -0.16968
C  0.864919 1.778422 -0.10851
C  2.873326 3.294479 0.223917
C  0.181708 2.871109 -0.951995
C  2.197268 4.391671 -0.630009
C  0.658102 4.285538 -0.545778
C  3.058962 0.770193 0.717244
C  4.580939 0.633431 0.53384
C  -0.275331 -0.413856 0.319397
C  -1.641811 0.163336 0.697916
C  -0.371231 -1.802978 -0.319666
C  5.226336 -0.418161 1.419111
C  -1.926751 0.530334 2.033875
C  -1.095117 -2.827401 0.341249
C  -2.636237 0.357568 -0.294917
C  0.27572 -2.098373 -1.542741
C  -3.182201 1.07896 2.388446
C  -1.171968 -4.128274 -0.200441
C  -3.892288 0.905204 0.036196
C  0.203408 -3.394921 -2.102998
C  -4.144916 1.257455 1.37898
C  -0.518161 -4.390387 -1.420284
H  2.700079 1.679668 -1.22854
H  0.543179 1.872096 0.952449
H  2.635283 3.465392 1.29566
H  3.973606 3.375147 0.129195
H  0.422895 2.685174 -2.017672
H  -0.914715 2.779435 -0.846204
H  2.533684 5.392131 -0.296095
H  2.51416 4.28199 -1.687639
H  0.179367 5.043076 -1.194948
H  0.331903 4.503775 0.49231
H  2.842989 0.977395 1.784807
H  2.594112 -0.205372 0.485046
H  4.838681 0.389603 -0.519943
H  5.111222 1.588644 0.741198
H  0.331448 -0.496265 1.24993
H  6.323266 -0.57215 1.238718
H  -1.168871 0.385112 2.813728
H  -1.612975 -2.612185 1.283132
H  -2.420238 0.078504 -1.331981
H  0.830732 -1.306919 -2.051765
H  -3.402676 1.360387 3.422008
H  -1.728659 -4.917646 0.312562
H  -4.661124 1.053002 -0.727737
H  0.701435 -3.623469 -3.049789
