program: Gaussian 09
title: 000181274
version: EM64L-G09RevD.01
frameworkgroup: C1[X(C9H13NO2)]
method: RPBEPBE
basis: SDD
operation: Freq
keyword: #p
keyword: freq=noraman
keyword: PBEPBE/SDD
title: #p freq=noraman PBEPBE/SDD
converged: YES YES NO NO
title: Mulliken charges:
elementType: O O N C C C C C C C C C H H H H H H H H H H H H H
charge: -0.293970 -0.293176 -0.094199 -0.462458 0.211086 -0.321298 -0.201056 -0.178375 0.137499 -0.611082 -0.214524 -0.677967 0.232905 0.233055 0.276350 0.211409 0.232716 0.237345 0.238158 0.231436 0.223709 0.221910 0.207354 0.226557 0.226616
chargesum: 0.00000
title: Mulliken charges with hydrogens summed into heavy atoms:
elementType: O O N C C C C C C C C C
charge: -0.293970 -0.293176 -0.094199 0.003502 0.211086 -0.044948 0.010353 0.054341 0.137499 0.095856 0.231095 -0.017438
polarizability: 1.76244337e+02 8.22901498e-01 1.12717591e+02 -4.88478938e-01 -1.29136838e-01 6.35877252e+01
1716.lowfreq: -17.6003 -7.6787 -6.0666 -0.0009 -0.0007 -0.0005 22.8425 30.6741 67.2744
frequency: 18.9111 30.4946 67.2443 73.6150 94.0840 132.2251 166.5854 216.9891 241.5975 273.4797 294.8115 358.2438 373.4246 427.1053 459.6819 522.9968 529.5379 656.7434 691.8348 729.6194 738.3713 796.5255 803.3697 884.3334 928.3571 930.4463 931.6957 985.4948 990.4680 1014.9823 1037.8850 1095.7371 1110.2378 1116.2175 1136.5696 1171.4128 1192.1858 1192.2933 1245.0983 1258.2004 1313.2454 1351.6711 1373.7106 1383.7889 1395.9029 1409.6095 1449.0481 1462.3763 1467.6314 1474.3179 1481.5950 1488.1465 1494.1272 1585.0911 1625.3710 1694.7830 2946.8389 2968.0691 2970.0225 2991.6313 3002.7795 3042.3982 3058.6759 3088.3336 3101.9697 3107.8701 3141.0783 3155.8823 3172.7131
redmass: 2.3402 1.3031 2.4060 3.3403 3.6770 2.6031 2.3822 4.0346 1.4221 2.7297 4.6324 3.6118 4.0516 3.5241 4.7085 2.3318 5.2407 7.2157 4.4749 1.5485 7.4344 1.1002 3.7650 3.4107 3.7734 1.3321 1.2790 1.7696 2.6973 2.5603 3.3573 1.6147 2.2147 1.2902 1.4707 3.8542 1.1471 1.0818 1.1356 2.8822 1.3630 1.4156 2.2832 1.9943 1.2830 2.3622 1.2751 1.0412 1.0427 1.0566 1.0912 1.0709 1.1085 10.0033 7.1512 6.1002 1.0594 1.0362 1.1004 1.0356 1.0579 1.1021 1.1063 1.0986 1.1022 1.0979 1.0855 1.0928 1.1003
irintensity: 1.0659 0.6606 0.6887 4.2736 2.0553 2.4546 0.8736 4.6344 0.1023 3.1489 3.9848 8.6092 0.1578 0.0152 5.7104 34.5039 1.3521 0.1885 37.7318 17.9699 3.4449 3.2735 14.1075 15.3853 3.0220 1.7081 12.4843 5.1071 46.3426 88.7286 325.0859 10.6177 6.6246 1.7349 5.2022 511.4950 11.3910 1.1080 0.0354 118.9706 1.6096 14.1127 12.5247 41.4910 17.4937 40.4166 14.0110 11.4610 13.3654 7.5051 1.0290 11.4405 37.4299 487.5245 123.9762 111.5806 50.8769 109.4984 27.3539 26.3403 27.4732 34.8377 11.7059 36.8936 49.6633 12.6884 2.5684 1.8319 31.2328
temp: 298.150 k
press: 1.00000 atm
elementType: 8 8 7 6 6 6 6 6 6 6 6 6 1 1 1 1 1 1 1 1 1 1 1 1 1
symmnumber: 1
zpe: 539024.1 jmol-1
zpe.correction: 0.205303 hartree
zpe.thermalcorrener: 0.218310 hartree
zpe.thermalcorrenthalpy: 0.219254 hartree
zpe.thermalcorrgfe: 0.163588 hartree
zpe.sumelectzpe: -555.016890 hartree
zpe.sumelectthermal: -555.003883 hartree
zpe.sumelectthermalent: -555.002939 hartree
zpe.sumelectthermalfe: -555.058605 hartree
dipole: -2.8896 1.3874 0.0499
dipole: 3.2058
quadrupole: -49.1848 -73.8814 -73.5442
quadrupole: 5.2793 -0.1087 -0.1242
quadrupole: 16.3520 -8.3446 -8.0074 5.2793 -0.1087 -0.1242
hfenergy: -555.2221931 hartree
pointgroup: C01 [X(C9H13N1O2)]
dipole: -1.1505306 0.5152932 0.0386396 debye
dipolederiv: -1.8509708 -0.2590561 0.0054404 -0.6233527 -0.5705676 -0.0018002 -0.0089925 -0.0050019 -0.28254 -0.8285062 0.1900483 0.0092865 0.4329969 -1.1218645 -0.0243361 0.0114212 -0.0184209 -0.3428486 -1.6321964 0.2303645 0.0261916 0.2612236 -0.9174128 -0.01188 -0.0065556 -0.0215119 -0.1687555 0.0510162 0.0621564 0.0041911 0.0931247 0.0051616 -0.0057071 0.0044623 -0.0049044 0.3025017 -1.540541 0.3169912 0.0216333 -0.2177947 -0.0098274 0.0045326 0.0184604 -0.0016464 -0.1672379 1.7356834 -0.3262538 -0.0261159 0.0746149 -0.0245128 0.0005715 -0.0114944 0.0069914 -0.0492255 0.0498166 -0.1461801 -0.0052245 -0.0003506 -0.1251049 0.0017949 -0.0020633 0.0033045 -0.2674664 0.0581982 -0.10596 -0.0030037 -0.2841452 0.8814481 0.019975 -0.0007865 0.0195742 -0.1341206 2.4929225 -0.15013 -0.0259728 -0.0628928 1.2918589 0.0294929 -0.0243038 0.0238071 0.2040019 0.6696029 0.2766721 -0.0122731 0.4009445 0.2460297 -0.0130132 0.0007081 -0.0109995 0.2677319 1.0772899 0.041096 -0.0059216 -0.0848393 0.2409866 -0.0007912 -0.0007938 0.0009406 0.3601281 -0.089203 -0.0949803 -0.0050984 -0.066926 -0.0171624 -0.007256 -0.0041942 -0.007068 0.0632161 0.0266625 -0.0940939 0.0809375 -0.0617399 0.0210833 0.0640336 0.1024571 0.1072109 -0.0513304 0.0233479 -0.0940193 -0.085401 -0.0607768 0.0272042 -0.0600059 -0.1069178 -0.1027407 -0.0530342 0.1331438 -0.0105681 -0.000224 -0.0099681 -0.0236309 -0.0029159 -0.0022384 -0.0030125 0.1647733 0.0460001 0.0552987 0.002113 0.0799989 -0.1102128 -0.0047325 0.0007665 -0.0034719 0.1631882 -0.1094818 0.0657028 0.0040759 0.0298111 0.0674872 -0.0022564 0.0023783 -0.0031204 0.1812482 -0.1382113 -0.0628064 -0.0922281 -0.006929 0.0916852 0.0649744 -0.1693784 0.0062662 -0.0571335 -0.1269105 -0.0750536 0.0891001 -0.0395636 0.0918863 -0.0499871 0.1829656 0.0163611 -0.0878478 0.0644177 0.1101211 0.0091167 -0.0030284 -0.0866277 -0.0100124 0.003585 -0.0104528 0.1189809 -0.0730854 -0.0217579 0.0085579 0.0698495 -0.0163739 0.0969394 -0.0362609 0.101672 -0.0552248 -0.0825702 -0.0195475 -0.0065898 0.0650743 0.0035777 -0.0932558 0.0447979 -0.0996627 -0.0828338 -0.1931656 0.0514289 0.0029676 0.0771257 0.0541152 -0.0028704 0.0039466 -0.0030543 0.1121224 0.1181813 0.03254 -0.0420807 -0.0313495 -0.0127933 0.1068191 -0.0130792 0.1204924 -0.0561123 0.1185594 0.0279873 0.046522 -0.0311075 0.0135668 -0.0983132 0.01111 -0.1115519 -0.0821812 unknown
polarizability: 176.1435789|2.5063165|112.7915456|-1.3126169|0.7983711|63.6145287 unknown
InChI: InChI=1S/C9H13NO2/c1-3-12-9(11)8-5-4-6-10(2)7-8/h4,6-7H,3,5H2,1-2H3
charge 0 multiplicity 1
25 atoms
O  2.159266 0.248509 -0.025594
O  1.331069 -1.94308 -0.066433
N  -2.606838 -0.348984 0.012776
C  -0.296741 1.500067 0.017349
C  -0.194319 -0.026215 -0.01004
C  -1.311598 -0.836604 -0.009366
C  -1.756293 1.934268 0.039648
C  -2.797495 1.058253 0.037781
C  1.108228 -0.697421 -0.037409
C  -3.777142 -1.238131 0.033768
C  3.533146 -0.3232 -0.051042
C  4.502401 0.85354 0.024325
H  0.226788 1.937622 -0.858119
H  0.245293 1.907955 0.895894
H  -1.186449 -1.924042 -0.028085
H  -1.980648 3.006324 0.057037
H  -3.841076 1.386179 0.053678
H  -4.443728 -1.035331 -0.825708
H  -4.358008 -1.113282 0.96775
H  -3.444042 -2.286209 -0.028416
H  3.643882 -1.017034 0.802487
H  3.653973 -0.909927 -0.980398
H  5.54462 0.485048 0.006535
H  4.360199 1.536498 -0.831033
H  4.351817 1.4272 0.955116
