program: Gaussian 09
title: 000181241
version: EM64L-G09RevD.01
frameworkgroup: C1[X(C15H16N2O2)]
method: RPBEPBE
basis: SDD
operation: Freq
keyword: #p
keyword: freq=noraman
keyword: PBEPBE/SDD
title: #p freq=noraman PBEPBE/SDD
converged: YES YES NO NO
title: Mulliken charges:
elementType: O O N N C C C C C C C C C C C C C C C H H H H H H H H H H H H H H H H
charge: -0.268053 -0.294360 -0.275214 -0.510409 0.432513 0.476860 0.254329 -0.707925 -0.320255 -0.376133 -0.437442 -0.335580 0.316280 -0.335049 -0.342804 -0.224845 -0.225369 -0.251591 -0.537875 0.324099 0.267210 0.246036 0.226969 0.288917 0.237392 0.214895 0.307311 0.249003 0.239606 0.225453 0.223728 0.228105 0.220509 0.220957 0.242733
chargesum: 0.00000
title: Mulliken charges with hydrogens summed into heavy atoms:
elementType: O O N N C C C C C C C C C C C C C C C
charge: -0.268053 -0.294360 -0.275214 -0.186310 0.432513 0.476860 0.254329 0.032291 -0.031338 -0.138741 -0.222547 -0.028270 0.316280 -0.086046 -0.103198 0.000608 -0.001641 -0.023486 0.146323
polarizability: 3.22901207e+02 -2.98171433e+00 1.81937597e+02 -8.69677944e+00 -9.03847753e+00 8.95988146e+01
1716.lowfreq: -5.1540 0.0002 0.0005 0.0008 3.0679 10.2073 18.1333 30.2831 53.6991
frequency: 17.9680 30.1278 53.6662 63.9865 69.7806 99.0275 134.5403 166.2045 179.3460 195.5905 225.7229 240.9629 258.9485 302.6291 345.2080 355.9739 370.1266 395.7825 410.2318 416.2568 447.3328 506.1172 511.9680 521.8142 562.6086 574.1259 614.1502 626.4445 645.0086 695.5698 697.7265 720.4444 728.5852 765.2348 786.9290 810.8626 832.2245 834.2555 854.4355 904.0874 936.5936 942.2511 964.3549 971.6292 985.5858 988.3615 988.6457 1001.4213 1029.3946 1083.7472 1101.5161 1112.2337 1112.4776 1116.2829 1137.5662 1158.6553 1172.9721 1179.9570 1194.4493 1219.9921 1220.5768 1259.3501 1306.9594 1313.5983 1329.0988 1373.8034 1380.8380 1419.5636 1435.9089 1440.2008 1442.1699 1465.6350 1474.5680 1486.0957 1487.7013 1495.6650 1503.8300 1513.6166 1587.2684 1595.5116 1606.0727 1622.1205 1631.5898 2943.6120 2956.9280 3036.9144 3043.3181 3105.4754 3109.3468 3122.7227 3124.8648 3134.5673 3147.3490 3157.2086 3164.0973 3167.7563 3195.9459 3206.6188 3551.9920
redmass: 3.7756 6.0617 4.6645 4.2751 4.6654 3.6400 4.1106 3.6983 3.7382 2.4835 2.9329 1.1870 2.1425 3.9548 5.1093 3.5650 4.6304 4.0879 2.8916 3.1491 4.4480 3.9048 3.2482 2.3579 1.3442 5.0718 6.1362 6.3786 5.8606 1.8671 10.0937 3.7245 5.5271 1.8792 5.1596 1.3308 1.2518 1.5608 5.9529 1.4391 1.3637 3.9655 1.3683 1.3107 3.0648 1.6632 7.6634 2.7134 2.2293 1.6932 1.6484 1.4879 1.2617 1.3619 2.8884 1.3316 1.0516 1.2234 1.1246 3.6641 2.5241 2.3677 1.5564 2.3191 1.6100 5.1975 8.1319 4.1057 1.1722 1.5971 1.5608 1.0503 1.0856 2.0999 1.2422 1.0566 2.3273 1.8525 6.3115 6.1021 5.5479 5.5861 6.5257 1.0449 1.0330 1.0933 1.1038 1.0962 1.0897 1.0992 1.0846 1.0889 1.0943 1.0896 1.1003 1.0945 1.0945 1.0944 1.0756
irintensity: 0.5881 1.4637 10.8656 1.4022 0.1776 6.1740 4.7412 0.7796 3.5866 0.2666 1.2790 0.1135 0.2348 3.0558 5.3214 1.3802 4.8842 3.0242 0.8767 0.0539 5.8178 33.0110 5.8622 38.5635 46.1419 9.8253 2.4426 2.6178 6.0322 43.9090 16.3855 0.2258 17.8201 70.1459 1.1790 18.1417 1.0643 88.0969 1.9813 5.4099 0.1968 30.5616 0.9250 4.1311 2.6228 0.7524 33.1229 21.5863 30.0104 9.7367 95.6573 58.6706 0.4718 9.8082 145.1601 7.7478 3.4726 59.5581 0.2921 168.4620 279.2715 41.3247 6.0101 176.3641 99.4172 184.4303 2.6209 49.2676 31.3011 35.9184 28.0637 13.0030 77.3617 150.4340 468.9812 25.5864 87.4966 431.3711 3.1795 20.9331 67.3539 128.4929 1.8019 56.9566 74.0195 26.7367 51.9937 17.0379 22.3712 28.9896 3.5071 7.8772 37.7461 12.2099 27.5894 7.0194 8.5138 2.3519 11.0878
temp: 298.150 k
press: 1.00000 atm
elementType: 8 8 7 7 6 6 6 6 6 6 6 6 6 6 6 6 6 6 6 1 1 1 1 1 1 1 1 1 1 1 1 1 1 1 1
symmnumber: 1
zpe: 735288.0 jmol-1
zpe.correction: 0.280056 hartree
zpe.thermalcorrener: 0.297548 hartree
zpe.thermalcorrenthalpy: 0.298492 hartree
zpe.thermalcorrgfe: 0.232927 hartree
zpe.sumelectzpe: -839.773806 hartree
zpe.sumelectthermal: -839.756315 hartree
zpe.sumelectthermalent: -839.755370 hartree
zpe.sumelectthermalfe: -839.820936 hartree
dipole: 0.3036 2.6591 0.4136
dipole: 2.7082
quadrupole: -98.5151 -95.1919 -116.9342
quadrupole: 14.5400 -0.8133 -1.6948
quadrupole: 5.0320 8.3552 -13.3872 14.5400 -0.8133 -1.6948
hfenergy: -840.0538625 hartree
pointgroup: C01 [X(C15H16N2O2)]
dipole: -0.0942665 1.0528705 -0.1335649 debye
polarizability: 323.0949272|-0.1150309|181.2729826|-6.4464613|11.8521099|90.0697096 unknown
InChI: InChI=1S/C15H16N2O2/c1-17(13-6-4-3-5-7-13)15(18)16-12-8-10-14(19-2)11-9-12/h3-11,16H,1-2H3
charge 0 multiplicity 1
35 atoms
O  5.951409 -0.291691 0.159038
O  -0.646785 -1.15851 -0.077186
N  -1.933514 0.820762 -0.251329
N  0.417834 0.931169 -0.013573
C  -3.208096 0.16294 -0.093252
C  1.785694 0.524612 0.029265
C  -0.711885 0.106994 -0.113788
C  -1.935301 2.278483 -0.496664
C  -3.438111 -1.159106 -0.561663
C  -4.276932 0.873481 0.518955
C  2.763188 1.557321 0.104342
C  2.215928 -0.824992 0.001342
C  4.558984 -0.09715 0.113192
C  4.132846 1.253816 0.147395
C  3.595202 -1.1306 0.039938
C  -4.713755 -1.744167 -0.414907
C  -5.551325 0.280895 0.649125
C  -5.779411 -1.033119 0.183453
C  6.434969 -1.672815 0.129435
H  0.27427 1.93531 0.093984
H  -2.914507 2.571193 -0.904522
H  -1.177234 2.539353 -1.257638
H  -1.755944 2.878979 0.420233
H  -2.619688 -1.718309 -1.015538
H  -4.112668 1.87979 0.919395
H  2.448566 2.609365 0.126816
H  1.47056 -1.62037 -0.042362
H  4.887053 2.044155 0.205345
H  3.89665 -2.182232 0.017053
H  -4.874563 -2.764508 -0.781041
H  -6.360186 0.845139 1.127005
H  -6.766923 -1.49535 0.287605
H  6.134035 -2.186168 -0.804977
H  6.066925 -2.248311 1.001499
H  7.531411 -1.595457 0.172924
