program: Gaussian 09
title: 000181238
version: EM64L-G09RevD.01
frameworkgroup: C1[X(C12H19N)]
method: RPBEPBE
basis: SDD
operation: Freq
keyword: #pfreq=noraman
keyword: PBEPBE/SDD
title: #p freq=noraman PBEPBE/SDD
converged: YES YES NO NO
title: Mulliken charges:
elementType: N C C C C C C C C C C C C H H H H H H H H H H H H H H H H H H H
charge: -0.532254 -0.098076 -0.094851 -0.342537 -0.315865 -0.463439 -0.453435 -0.456343 -0.457254 -0.460989 0.578388 -0.469828 -0.463840 0.202050 0.201608 0.216920 0.211854 0.197127 0.197030 0.209494 0.197656 0.198616 0.206934 0.199195 0.208935 0.205433 0.199962 0.222018 0.215438 0.215214 0.262379 0.262458
chargesum: 0.00000
title: Mulliken charges with hydrogens summed into heavy atoms:
elementType: N C C C C C C C C C C C C
charge: -0.007416 0.103973 0.106758 -0.125617 -0.104011 -0.069282 -0.046285 -0.050794 -0.049124 -0.055593 0.578388 -0.247809 -0.033188
polarizability: 1.59727182e+02 3.69351790e+00 1.13655031e+02 1.30115977e+00 1.28084331e+00 1.11836117e+02
1716.lowfreq: -46.4770 -42.6392 -0.0004 0.0005 0.0007 26.7331 33.0275 67.5340 150.4487
frequency: 18.3459 65.9909 150.3653 178.3546 246.6456 281.3362 292.5099 324.3567 342.5541 386.4424 421.0208 423.1709 455.9644 474.2579 584.6472 602.8282 633.5630 668.7259 706.7369 713.3498 770.0011 787.3689 825.8654 837.4216 867.9455 873.8350 882.1893 896.5198 910.9672 942.4410 955.3335 994.1410 1013.3946 1031.2082 1044.4140 1059.7822 1063.0053 1064.6106 1069.1753 1098.0309 1100.8419 1109.7060 1112.9747 1138.4716 1147.1510 1208.1926 1229.4672 1244.3377 1259.8270 1274.5592 1287.9409 1291.5623 1305.1598 1318.7534 1320.0991 1322.8059 1329.1805 1339.2349 1344.4958 1346.0454 1346.4000 1353.6196 1380.6869 1446.6661 1455.7368 1458.0911 1461.0555 1463.2939 1479.9135 1641.8279 1673.6482 2961.1852 2963.3207 2964.5850 2965.2245 2966.5360 2986.6690 2992.2935 2994.4864 3003.8200 3018.9846 3020.0842 3022.7900 3027.3800 3030.3589 3032.1970 3041.8456 3060.7598 3426.2708 3552.1354
redmass: 3.3577 2.7267 3.5120 2.0131 1.2676 2.4322 2.1253 2.6645 1.9956 4.3760 1.7886 1.7499 3.3651 2.5913 5.8475 3.1288 3.5755 1.6556 2.9599 3.4211 3.2094 2.7503 2.2682 1.7475 1.5576 1.5958 1.8633 1.6162 1.8997 2.1047 2.0949 2.2118 4.0625 2.0660 3.2039 1.9049 1.6123 1.6616 2.2821 1.6022 1.4176 1.0092 1.0128 1.3145 1.2305 1.0551 1.4812 1.4992 1.7142 1.7104 1.9534 1.9963 1.4366 1.6620 1.3162 1.3076 1.2259 1.3138 1.5399 1.6229 1.4449 1.4992 1.5806 1.0838 1.0867 1.0827 1.0895 1.0929 1.0898 1.0870 7.7002 1.0636 1.0629 1.0617 1.0604 1.0605 1.0631 1.0829 1.0841 1.0839 1.1022 1.0871 1.1028 1.1021 1.1024 1.1019 1.0917 1.0953 1.0447 1.0965
irintensity: 0.2152 0.6665 0.9302 12.0108 44.5176 3.6313 1.0452 2.8258 0.6931 0.2260 0.2283 0.0668 6.3172 5.2331 3.3983 18.8050 2.6517 312.8453 4.5944 20.8101 1.2950 2.6739 2.5823 6.8127 0.4520 1.2912 13.8466 3.9646 3.2080 4.5055 9.7370 1.3216 2.1872 0.3863 6.8986 4.4440 0.0729 2.4358 13.2895 8.4846 3.3151 0.0051 0.0629 4.6776 0.2183 0.1424 3.2903 0.0324 0.0577 0.4113 0.4249 0.4149 0.6467 3.2901 0.0114 0.0329 6.3542 0.2647 0.5880 0.1658 1.6863 0.0153 0.6517 1.3864 7.9303 8.9144 15.3388 16.6718 5.4092 29.5942 8.8191 23.4558 22.1481 14.7186 5.4400 69.9488 36.0664 147.0294 133.3310 99.2652 4.8334 49.9365 0.2013 61.9397 50.1657 77.8352 0.9668 62.0053 2.6453 0.1196
temp: 298.150 k
press: 1.00000 atm
elementType: 7 6 6 6 6 6 6 6 6 6 6 6 6 1 1 1 1 1 1 1 1 1 1 1 1 1 1 1 1 1 1 1
symmnumber: 1
zpe: 754732.9 jmol-1
zpe.correction: 0.287463 hartree
zpe.thermalcorrener: 0.298893 hartree
zpe.thermalcorrenthalpy: 0.299837 hartree
zpe.thermalcorrgfe: 0.249666 hartree
zpe.sumelectzpe: -522.401370 hartree
zpe.sumelectthermal: -522.389940 hartree
zpe.sumelectthermalent: -522.388996 hartree
zpe.sumelectthermalfe: -522.439167 hartree
dipole: 1.4413 -0.4545 -0.8731
dipole: 1.7453
quadrupole: -86.7864 -79.2575 -78.4370
quadrupole: 4.3446 4.7443 0.1161
quadrupole: -5.2928 2.2362 3.0566 4.3446 4.7443 0.1161
hfenergy: -522.6888327 hartree
pointgroup: C01 [X(C12H19N1)]
dipole: -0.5693808 0.3722056 -0.093615 debye
polarizability: 159.801022|3.4475768|113.983652|0.3205849|0.8457988|111.4336556 unknown
InChI: InChI=1S/C12H19N/c13-2-1-12-10-4-8-3-9(6-10)7-11(12)5-8/h1,8-11H,2-7,13H2
charge 0 multiplicity 1
32 atoms
N  4.275214 -0.108144 -0.65763
C  -1.9593 -0.261818 1.185632
C  -1.730162 -0.100639 -1.339569
C  -0.323829 1.39391 0.16095
C  0.166104 -1.08648 0.048799
C  -2.719032 -0.348625 -0.167215
C  -1.327228 1.149207 1.330266
C  -1.095386 1.308572 -1.191578
C  -0.837612 -1.336024 1.217548
C  -0.607532 -1.172821 -1.304587
C  0.758618 0.313507 0.199564
C  2.077727 0.615135 0.36982
C  3.260412 -0.342556 0.407479
H  -2.665555 -0.439531 2.020939
H  -2.272662 -0.164564 -2.303827
H  0.139205 2.394246 0.267249
H  0.95363 -1.861604 0.071877
H  -3.190752 -1.346285 -0.274054
H  -3.533135 0.40354 -0.193718
H  -0.800944 1.235172 2.301099
H  -2.118818 1.925703 1.310188
H  -1.884244 2.087552 -1.220594
H  -0.403036 1.505418 -2.033804
H  -1.27887 -2.348411 1.116718
H  -0.303085 -1.301098 2.187027
H  0.092201 -1.020739 -2.149935
H  -1.045446 -2.18568 -1.414093
H  2.350831 1.679781 0.46861
H  3.787025 -0.256335 1.378298
H  2.922657 -1.391182 0.331226
H  4.794436 0.76897 -0.530092
H  3.868068 -0.150676 -1.599993
