program: Gaussian 09
title: 000181230
version: EM64L-G09RevD.01
frameworkgroup: C1[X(C16H22O3)]
method: RPBEPBE
basis: SDD
operation: Freq
keyword: #pfreq=noraman
keyword: PBEPBE/SDD
title: #p freq=noraman PBEPBE/SDD
converged: NO YES NO NO
title: Mulliken charges:
elementType: O O O C C C C C C C C C C C C C C C C H H H H H H H H H H H H H H H H H H H H H H
charge: -0.256306 -0.439906 -0.177135 0.197157 -0.277015 0.258391 -0.158958 0.510664 0.091862 -0.467351 -0.839990 -0.231212 -0.110819 -0.817073 -0.416724 -0.498258 -0.522795 -0.330861 -0.719211 0.259613 0.240769 0.194219 0.235179 0.234376 0.286575 0.217770 0.219490 0.231818 0.236257 0.247058 0.236502 0.224938 0.227459 0.232841 0.244659 0.229406 0.206617 0.221369 0.220019 0.214446 0.344155
chargesum: 0.00000
title: Mulliken charges with hydrogens summed into heavy atoms:
elementType: O O O C C C C C C C C C C C C C C C C
charge: -0.256306 -0.095751 -0.177135 0.197157 -0.017402 0.258391 0.081811 0.510664 0.091862 -0.037953 -0.101268 -0.011721 0.121000 -0.097255 -0.189265 -0.273319 -0.045295 0.105162 -0.063376
polarizability: 2.29628927e+02 4.62700707e-01 1.62034102e+02 -2.60760331e-01 -5.39498668e+00 1.44182878e+02
1716.lowfreq: -18.9053 -0.0004 0.0006 0.0008 3.0742 7.2847 41.1157 68.5013 95.8235
frequency: 40.9621 68.4752 95.8108 117.2096 135.5220 155.3579 186.4678 208.3353 218.5490 224.4075 233.6590 244.3112 258.7036 294.8440 300.1771 313.3455 322.8350 349.4005 360.9119 378.6884 391.2195 413.2361 438.7497 452.7870 465.4246 487.7628 521.1136 537.8980 556.0984 572.4754 595.7349 650.5633 670.5988 710.8950 728.7444 776.3671 789.0654 813.1608 829.0496 843.4873 850.9205 869.6116 883.4077 900.2349 906.5863 926.0882 955.7850 973.0702 976.7917 1002.7454 1011.6697 1024.0387 1044.5358 1062.6627 1069.6322 1079.1561 1091.9179 1106.5101 1132.7400 1138.0756 1145.9882 1173.1297 1180.9009 1188.4065 1199.9137 1207.3648 1238.0185 1244.3785 1256.3180 1267.0878 1286.2634 1290.5174 1296.9610 1311.6660 1322.1215 1338.4020 1351.2650 1365.4219 1377.8435 1379.0516 1389.4173 1393.5970 1398.9122 1441.4277 1454.8870 1463.6211 1464.3956 1473.8910 1476.9083 1480.0669 1484.3323 1492.9166 1613.8845 1621.8352 1648.5002 2927.2425 2971.7507 2974.8871 2977.2955 2984.0743 2991.0722 2996.3967 3003.9491 3036.9520 3056.6837 3073.1153 3073.2317 3076.9439 3079.1820 3080.1939 3086.5168 3090.7937 3097.0875 3101.8165 3122.1931 3134.1751 3537.3057
redmass: 3.9811 6.3652 5.2194 3.2272 3.3127 2.9606 1.6750 1.9402 2.4751 1.4628 1.5341 2.0449 2.9064 2.5614 2.2139 2.7512 3.6087 2.0936 2.5150 2.4137 1.4111 5.7461 3.7738 3.7166 2.9546 3.2522 2.6283 3.0088 4.3569 3.8847 4.0767 4.3218 3.6766 2.5446 3.7779 2.1989 3.5296 2.6255 2.5646 2.4082 2.0897 1.3800 2.5846 2.3829 2.0705 1.7213 1.8228 2.6479 1.3313 1.7267 4.2583 2.2382 1.7474 2.2389 2.4281 1.9322 2.1820 1.9393 1.9035 2.1302 1.7259 1.6495 2.7732 1.5834 1.4996 1.5662 1.8076 1.4179 1.8744 1.6592 1.3212 1.4307 1.3597 1.3825 1.5697 1.6185 1.2971 1.3769 1.3069 1.2503 1.3216 1.4069 1.5158 1.0906 1.0900 1.0610 1.0561 1.0459 1.0559 1.0547 1.0602 1.0587 9.8664 7.8458 7.7766 1.0811 1.0785 1.0354 1.0654 1.0635 1.0375 1.0612 1.0369 1.0875 1.0994 1.0991 1.0961 1.1004 1.1018 1.0903 1.1005 1.0993 1.0984 1.0855 1.0980 1.0979 1.0656
irintensity: 0.4566 1.9124 1.2473 1.6203 4.3686 2.4647 1.7293 5.5712 1.5106 1.8421 0.5719 0.2298 3.3264 1.3743 1.9770 0.5300 5.4972 52.1221 2.1032 2.9961 58.2025 3.9323 2.1295 8.8132 9.1319 8.1089 0.7220 5.5483 5.2901 10.3739 1.5475 3.8643 9.1644 0.4070 2.6796 22.8799 4.7487 3.7187 6.1929 7.8369 1.8120 27.8279 22.5902 11.5418 15.3543 0.9567 10.1902 28.6377 0.9966 2.3063 49.1197 15.1789 7.1643 33.6211 7.2835 29.5862 38.0194 21.7594 3.7769 4.8619 1.4066 42.1352 5.2817 8.7557 7.6985 53.2230 14.5886 0.8711 19.9831 8.1901 6.0129 18.1894 1.4755 6.6886 7.5720 6.5779 14.4891 7.1320 18.9228 21.8849 5.2926 29.1721 18.7869 18.9754 8.4574 5.7882 10.8435 13.2864 8.1017 0.5797 11.6820 1.3944 128.5742 13.4408 17.4869 17.5516 1.2532 46.2058 53.5428 38.3038 22.6073 15.9941 20.4768 31.5457 28.5020 10.6859 44.1925 45.5149 15.9153 30.9337 17.3376 38.3951 8.4172 5.1097 2.2740 31.7932 2.6784
temp: 298.150 k
press: 1.00000 atm
elementType: 8 8 8 6 6 6 6 6 6 6 6 6 6 6 6 6 6 6 6 1 1 1 1 1 1 1 1 1 1 1 1 1 1 1 1 1 1 1 1 1 1
symmnumber: 1
zpe: 908869.1 jmol-1
zpe.correction: 0.346170 hartree
zpe.thermalcorrener: 0.364283 hartree
zpe.thermalcorrenthalpy: 0.365227 hartree
zpe.thermalcorrgfe: 0.302369 hartree
zpe.sumelectzpe: -847.077342 hartree
zpe.sumelectthermal: -847.059229 hartree
zpe.sumelectthermalent: -847.058285 hartree
zpe.sumelectthermalfe: -847.121143 hartree
dipole: -1.1594 2.9316 1.8463
dipole: 3.6534
quadrupole: -104.3594 -124.0961 -113.9061
quadrupole: 1.7151 2.9671 -13.3935
quadrupole: 9.7611 -9.9755 0.2144 1.7151 2.9671 -13.3935
hfenergy: -847.423512 hartree
pointgroup: C01 [X(C16H22O3)]
dipole: -0.4398531 1.1481353 0.7445052 debye
polarizability: 229.5432377|0.5784235|162.0893599|-2.6414177|-5.3297324|144.2133102 unknown
InChI: InChI=1S/C16H22O3/c1-10-8-11-4-6-15(2)16(3,13(18)5-7-19-15)14(11)12(17)9-10/h4,6,8,10,12,14,17H,5,7,9H2,1-3H3
charge 0 multiplicity 1
41 atoms
O  1.954144 1.058031 1.32621
O  -1.671547 -1.7837 -1.409148
O  2.153794 -2.385585 -0.810611
C  0.964754 -0.237632 -0.605118
C  -0.440391 -0.168836 0.122552
C  1.764134 1.076181 -0.169503
C  -1.349862 -1.420609 -0.011611
C  -1.21367 1.099376 -0.244895
C  1.758987 -1.450634 -0.064016
C  -2.661497 -1.183849 0.772204
C  0.85581 -0.33334 -2.143356
C  0.937029 2.32195 -0.426123
C  -3.485101 -0.023201 0.151629
C  3.13698 1.204279 -0.868515
C  -0.424631 2.309607 -0.48787
C  -2.584961 1.135763 -0.240248
C  2.110795 -1.426861 1.423585
C  2.764715 -0.071363 1.802074
C  -4.608018 0.448386 1.111968
H  -0.202958 -0.06799 1.201853
H  -0.828998 -2.317419 0.369114
H  -2.422656 -0.940872 1.827476
H  -3.260797 -2.112151 0.769513
H  1.855335 -0.339262 -2.608484
H  0.36279 -1.276197 -2.421549
H  0.28221 0.515993 -2.553538
H  1.492341 3.258669 -0.558183
H  -3.989204 -0.406607 -0.763962
H  3.711743 0.261632 -0.865154
H  3.010913 1.511643 -1.920124
H  3.727751 1.983288 -0.353849
H  -3.086223 2.084784 -0.48696
H  -0.972163 3.239987 -0.690241
H  1.191916 -1.558361 2.026368
H  2.789458 -2.270234 1.640235
H  2.810851 0.057541 2.896034
H  3.795801 -0.019736 1.398171
H  -5.264728 -0.397956 1.385489
H  -4.178548 0.865619 2.041342
H  -5.235216 1.229507 0.643923
H  -1.964485 -0.961238 -1.880683
