program: Gaussian 09
title: 000181202
version: EM64L-G09RevD.01
frameworkgroup: C1[X(C21H12)]
method: RPBEPBE
basis: SDD
operation: Freq
keyword: #p
keyword: freq=noraman
keyword: PBEPBE/SDD
title: #p freq=noraman PBEPBE/SDD
converged: NO NO NO NO
title: Mulliken charges:
elementType: C C C C C C C C C C C C C C C C C C C C C H H H H H H H H H H H H
charge: -0.551749 0.204821 0.003828 -0.608171 0.489873 0.553549 0.468477 0.379426 0.484785 0.453966 -0.631720 -0.603395 -0.416393 -0.416068 -0.430143 -0.439878 -0.490889 -0.443666 -0.198025 -0.439823 -0.207346 0.262037 0.240261 0.240272 0.239936 0.242868 0.228106 0.226725 0.241599 0.233834 0.218310 0.250823 0.213773
chargesum: 0.00000
title: Mulliken charges with hydrogens summed into heavy atoms:
elementType: C C C C C C C C C C C C C C C C C C C C C
charge: -0.551749 0.204821 0.003828 -0.608171 0.489873 0.553549 0.468477 0.379426 0.484785 0.453966 -0.369683 -0.122862 -0.176457 -0.173201 -0.202037 -0.213153 -0.249290 -0.209832 0.020285 -0.189000 0.006427
polarizability: 3.98281220e+02 -5.86032047e+00 3.09452354e+02 -1.41438708e-03 -1.00199912e-03 8.62679637e+01
1716.lowfreq: -0.0009 -0.0005 0.0005 3.4808 10.1840 16.0104 81.3988 94.5851 107.6782
frequency: 81.3960 94.5792 107.6779 150.0410 238.9104 263.4643 268.2813 292.4237 322.8731 366.9510 378.3120 388.4972 410.3013 455.4566 460.0088 495.8384 500.7986 519.7282 547.9643 576.5180 578.8608 599.2311 611.1348 616.4820 663.2599 674.4703 696.7071 720.8529 747.4683 772.7425 772.9748 792.9458 804.9661 825.9746 833.4302 855.5148 883.8821 900.9277 920.0004 924.0662 932.0654 953.2928 960.4527 977.0943 977.9809 980.9865 983.3108 1018.4506 1054.1363 1083.1064 1125.6553 1133.6841 1157.8318 1175.5416 1184.8114 1192.5552 1206.7020 1226.8573 1238.4773 1257.5543 1310.3496 1320.5225 1326.7130 1337.8357 1369.0941 1381.7428 1394.4242 1418.4269 1427.0735 1436.2140 1455.0603 1462.4805 1463.4556 1495.3201 1514.6840 1546.2253 1574.1727 1601.0713 1608.4348 1630.6558 1682.5382 2937.9293 2964.6980 3108.8149 3110.5559 3114.6507 3117.9487 3129.8336 3132.7175 3136.4865 3143.9044 3151.0860 3176.5554
redmass: 4.4394 2.6727 4.1382 3.7226 4.1026 4.9267 5.1150 3.9181 3.8027 3.1270 7.6932 5.5960 6.1605 5.7283 3.3581 3.4683 5.4285 6.3420 3.5344 3.4147 4.7328 6.5741 3.4403 6.1974 2.6160 6.3116 1.9775 5.7658 1.9327 1.3632 5.5745 2.4483 1.8239 7.0272 1.9543 1.5916 5.9398 4.1714 6.1874 1.6389 1.7680 2.8145 1.4287 1.3652 1.4236 3.9340 1.3832 2.6137 2.9517 2.6538 1.8011 2.1580 1.2917 1.1010 1.3023 1.3165 1.7866 1.6490 2.0559 2.0226 3.4246 2.7458 2.4983 2.7659 2.2173 2.1224 3.2574 1.4393 2.3704 4.2766 3.7797 3.3288 4.4288 5.9496 6.3036 6.7894 6.3040 6.6467 8.7727 7.0298 10.8918 1.0606 1.0959 1.0875 1.0860 1.0850 1.0861 1.0916 1.0953 1.0961 1.0976 1.0972 1.0956
irintensity: 4.7890 0.3661 2.6744 2.0431 0.7519 1.8864 0.0280 1.0243 0.0306 2.3098 2.1443 7.4366 0.1208 1.1971 0.2603 0.0011 3.6763 6.5573 5.9743 5.4474 0.8634 0.1916 9.1228 0.6539 24.1201 3.0049 1.2390 0.2239 24.0975 12.0684 7.6668 1.7203 36.7391 5.8593 27.6772 92.4541 8.2288 11.0576 2.0383 0.0096 7.5677 13.4791 1.0619 0.1015 0.3537 15.0438 2.6559 4.3463 6.0220 8.3141 12.5129 2.9952 10.5315 1.9423 8.2657 2.8148 23.5380 7.0067 16.3089 3.0585 22.2857 21.1109 1.7431 20.3966 3.7433 14.0044 9.4051 78.0155 23.6339 30.9695 6.7171 1.0936 27.8642 7.3621 31.0780 8.4952 24.5097 17.8865 7.2387 7.2218 35.1425 23.4311 9.7585 17.7322 0.7803 2.1712 4.3609 9.7001 26.2508 61.6759 33.4831 58.0466 6.6014
temp: 298.150 k
press: 1.00000 atm
elementType: 6 6 6 6 6 6 6 6 6 6 6 6 6 6 6 6 6 6 6 6 6 1 1 1 1 1 1 1 1 1 1 1 1
symmnumber: 1
zpe: 669419.1 jmol-1
zpe.correction: 0.254968 hartree
zpe.thermalcorrener: 0.268408 hartree
zpe.thermalcorrenthalpy: 0.269352 hartree
zpe.thermalcorrgfe: 0.215702 hartree
zpe.sumelectzpe: -806.089124 hartree
zpe.sumelectthermal: -806.075684 hartree
zpe.sumelectthermalent: -806.074740 hartree
zpe.sumelectthermalfe: -806.128390 hartree
dipole: 2.0945 -1.6694 0.0005
dipole: 2.6784
quadrupole: -98.0690 -102.9255 -128.2333
quadrupole: -0.1977 0.0004 -0.0001
quadrupole: 11.6736 6.8171 -18.4907 -0.1977 0.0004 -0.0001
hfenergy: -806.3440923 hartree
pointgroup: C01 [X(C21H12)]
dipole: -0.8091184 -0.6750774 -0.0002014 debye
polarizability: 397.9744387|7.8422094|309.7591354|-0.0014365|0.0009701|86.2679637 unknown
InChI: InChI=1S/C21H12/c1-3-12-7-8-13-9-10-15-11-14-4-2-6-17-16(5-1)18(12)20(13)21(15)19(14)17/h1-2,4-11H,3H2
charge 0 multiplicity 1
33 atoms
C  0.752945 0.937294 0.000031
C  -0.637475 0.914904 -0.000002
C  -1.28962 -0.374142 -0.000037
C  1.509951 -0.229969 0.00001
C  -0.509756 -1.596746 -0.000013
C  0.941246 -1.526819 -0.000019
C  1.622707 2.105162 -0.000033
C  -2.734989 -0.372352 -0.000083
C  2.904456 0.140159 -0.000072
C  -1.322838 2.179265 -0.000028
C  2.955662 1.626543 -0.00009
C  -3.487781 -1.696306 -0.000271
C  -1.235683 -2.866872 0.000096
C  0.9087 3.374291 -0.000068
C  -3.409381 0.864078 -0.000049
C  -0.48847 3.390519 -0.000056
C  -2.731349 2.126903 -0.000035
C  1.91597 -2.59647 -0.000103
C  -2.603159 -2.924567 0.000039
C  3.809752 -0.931191 -0.000156
C  3.287286 -2.283554 -0.000163
H  3.874023 2.219154 -0.000136
H  -4.169981 -1.744009 0.876661
H  -4.169276 -1.744067 -0.877763
H  -0.657698 -3.797652 0.000266
H  1.459804 4.322766 -0.000102
H  -4.507153 0.866855 -0.000062
H  -1.010305 4.356539 -0.000074
H  -3.327324 3.048196 -0.000033
H  1.606706 -3.648267 -0.00014
H  -3.111796 -3.897342 0.000154
H  4.897379 -0.787619 -0.000234
H  4.012145 -3.106582 -0.000234
