program: Gaussian 09
title: 000181161
version: EM64L-G09RevD.01
frameworkgroup: C1[X(C6H3I3O3)]
method: RPBEPBE
basis: SDD
operation: Freq
keyword: #pfreq=noraman
keyword: PBEPBE/SDD
title: #p freq=noraman PBEPBE/SDD
converged: NO NO NO NO
title: Mulliken charges:
elementType: I I I O O O C C C C C C H H H
charge: 0.180321 0.180094 0.180252 -0.398461 -0.398343 -0.397959 0.698680 0.697023 0.698555 -0.825990 -0.824889 -0.824967 0.345405 0.345429 0.344852
chargesum: 0.00000
title: Mulliken charges with hydrogens summed into heavy atoms:
elementType: I I I O O O C C C C C C
charge: 0.180321 0.180094 0.180252 -0.053056 -0.052914 -0.053108 0.698680 0.697023 0.698555 -0.825990 -0.824889 -0.824967
polarizability: 2.04499869e+02 -1.69297120e-02 2.04486452e+02 4.25708721e-03 -5.71398095e-03 3.99876011e+01
1716.lowfreq: -4.3025 -4.2442 -1.8272 -0.0004 -0.0002 0.0002 71.3213 76.1429 78.4622
frequency: 71.3144 76.1390 78.4587 91.3729 91.9317 165.3544 207.1387 224.1670 235.7011 236.6129 312.9225 313.4619 374.6703 375.9768 438.6478 442.5348 448.2010 580.1854 617.6966 618.5516 648.0685 648.4079 648.6341 808.0598 1022.6522 1029.1760 1030.2067 1185.0203 1189.3692 1200.9008 1355.7657 1414.0649 1417.8396 1419.0927 1574.0731 1574.7735 3446.1537 3447.8033 3448.6553
redmass: 13.2845 9.2382 9.1740 63.8893 64.5740 114.0250 7.7516 8.0777 11.6139 11.7396 7.3253 7.3171 6.0260 6.0516 1.1471 1.1347 1.1019 10.0128 9.7875 9.7986 11.2122 11.2093 5.2785 11.8021 11.4940 7.7774 8.0373 1.4671 1.4617 1.5637 11.7169 3.7775 5.6623 5.5481 7.5193 7.4499 1.0649 1.0648 1.0649
irintensity: 1.0724 0.1822 0.0137 0.0607 0.0797 0.0001 4.9460 0.0184 2.7573 2.6410 0.0004 0.0083 21.8477 21.6129 32.0494 60.0608 295.0710 0.0114 44.4812 44.8046 0.0000 0.0000 0.0274 40.9046 0.0771 40.1974 38.8784 367.8413 377.3719 15.9415 0.0092 2.3709 107.3426 106.1222 71.6833 71.4987 106.7676 109.4103 53.0834
temp: 298.150 k
press: 1.00000 atm
elementType: 53 53 53 8 8 8 6 6 6 6 6 6 1 1 1
symmnumber: 1
zpe: 206414.2 jmol-1
zpe.correction: 0.078619 hartree
zpe.thermalcorrener: 0.091432 hartree
zpe.thermalcorrenthalpy: 0.092376 hartree
zpe.thermalcorrgfe: 0.035289 hartree
zpe.sumelectzpe: -489.736403 hartree
zpe.sumelectthermal: -489.723589 hartree
zpe.sumelectthermalent: -489.722645 hartree
zpe.sumelectthermalfe: -489.779733 hartree
dipole: -0.0057 -0.0040 -0.0001
dipole: 0.0070
quadrupole: -103.7135 -103.7193 -116.4498
quadrupole: -0.0218 -0.0001 -0.0005
quadrupole: 4.2474 4.2416 -8.4889 -0.0218 -0.0001 -0.0005
hfenergy: -489.8150217 hartree
pointgroup: C01 [X(C6H3I3O3)]
dipole: -0.0027183 -0.0003223 0.0000255 debye
dipolederiv: -0.3577374 -0.1213229 -0.0000203 -0.0710449 -0.0592508 -0.0000012 -0.0000027 -0.0000347 0.0856898 -0.2167033 0.1519616 -0.000029 0.2022326 -0.2001019 0.0000022 -0.0000069 0.0000311 0.085523 -0.0513149 -0.1062363 0.0000014 -0.0561514 -0.3669096 0.0000158 -0.0002002 0.0000568 0.0860812 -0.3092779 -0.3319415 -0.000011 -0.1794747 -1.2268287 -0.0000093 -0.0000347 0.0000658 -0.3857749 -0.7762242 0.4489959 -0.0000381 0.6021808 -0.7604067 0.0000301 -0.0000538 0.0000599 -0.3857621 -1.2182613 -0.3460448 0.0000058 -0.193106 -0.3185012 -0.0000433 -0.0000095 -0.0000424 -0.3849572 0.1370611 0.3113515 0.0000389 0.1632755 0.9653539 0.0000397 -0.0000238 -0.0000742 0.2800933 0.5542892 -0.4014886 0.0000146 -0.5521911 0.5504454 -0.0000017 -0.0001937 -0.0002796 0.2804861 0.9626745 0.3146178 0.0000109 0.1658793 0.1389261 0.0000387 0.0000215 0.0000497 0.2793417 0.6682105 0.2244207 0.0000784 0.2335505 -0.5461777 -0.0000234 0.0002062 0.0002519 -0.3327461 -0.0437889 -0.6449596 -0.000014 -0.6368303 0.166592 -0.0000068 0.0000634 -0.000002 -0.3329325 -0.440598 0.4074602 -0.0000191 0.4170653 0.5640202 -0.000065 0.0002506 -0.0000596 -0.332943 0.3589271 0.114728 0.0000104 0.0519678 0.3689425 -0.0000092 0.0000237 0.000002 0.3530354 0.2947951 -0.0149978 0.000006 -0.0779779 0.4334982 -0.0000033 0.0000058 -0.0000103 0.3526075 0.4379483 -0.0065442 -0.0000349 -0.0693756 0.2903981 0.0000367 -0.000046 -0.0000144 0.3522577 unknown
polarizability: 204.4770005|0.0083955|204.5093199|0.0006699|-0.0070939|39.9876011 unknown
InChI: InChI=1S/C6H3I3O3/c7-1-4(10)2(8)6(12)3(9)5(1)11/h10-12H
charge 0 multiplicity 1
15 atoms
I  -3.493675 -0.639627 -0.000188
I  2.299552 -2.706594 0.000136
I  1.196414 3.344771 -0.000064
O  -1.016036 -2.614443 -0.000024
O  -1.756364 2.187042 -0.000189
O  2.772161 0.427807 0.00008
C  -0.482442 -1.336847 -0.000031
C  -0.916557 1.086383 -0.000115
C  1.399001 0.250419 0.000019
C  -1.392254 -0.250908 -0.000103
C  0.913426 -1.080379 0.000029
C  0.478923 1.331219 -0.000052
H  -0.289532 -3.2957 0.00004
H  -2.70943 1.897953 -0.000201
H  2.996213 1.398305 0.000064
