program: Gaussian 09
title: 000181165
version: EM64L-G09RevD.01
frameworkgroup: C1[X(C17H21NO5)]
method: RPBEPBE
basis: SDD
operation: Freq
keyword: #p
keyword: freq=noraman
keyword: PBEPBE/SDD
title: #p freq=noraman PBEPBE/SDD
converged: YES YES NO NO
title: Mulliken charges:
elementType: O O O O O N C C C C C C C C C C C C C C C C C H H H H H H H H H H H H H H H H H H H H H
charge: -0.299234 -0.318136 -0.186902 -0.457780 -0.446295 -0.095308 -0.148785 -0.148262 -0.183418 -0.171610 -0.433076 -0.465752 0.009480 -0.632540 0.198828 0.021901 -0.429922 0.372172 -0.390110 -0.390108 -0.214952 -0.234925 -0.240421 0.258749 0.253425 0.243288 0.244310 0.232819 0.241255 0.201829 0.241544 0.252915 0.217220 0.218680 0.246920 0.224580 0.258360 0.369832 0.294975 0.239870 0.359238 0.228834 0.227223 0.229290
chargesum: 0.00000
title: Mulliken charges with hydrogens summed into heavy atoms:
elementType: O O O O O N C C C C C C C C C C C C C C C C C
charge: -0.299234 -0.318136 -0.186902 -0.087948 -0.087057 -0.095308 0.109963 0.105162 0.059870 0.072700 0.040999 -0.022379 0.262395 0.050280 0.198828 0.021901 0.053018 0.372172 -0.095135 -0.150238 0.013882 -0.007703 -0.011131
polarizability: 2.30245799e+02 1.36044330e+01 1.98679943e+02 2.05865901e+01 -6.08504879e+00 1.57654748e+02
1716.lowfreq: -17.1121 -10.2793 -6.3060 0.0005 0.0008 0.0009 8.6965 22.9135 35.7436
frequency: -3.3912 22.4841 35.6878 46.7708 61.3915 83.5824 98.0895 129.6364 146.2473 148.6761 169.8476 218.3299 226.5815 233.5154 245.8877 282.3375 288.2911 307.4576 317.8167 321.9814 359.9246 370.7110 405.0878 411.0880 427.0050 433.9650 444.6662 492.4407 504.4228 521.5917 530.9199 598.3837 615.8987 633.4857 650.9557 670.4253 693.6215 709.2999 739.9257 752.0431 771.1755 778.1406 781.0474 807.0494 848.1694 854.2081 860.2052 869.3411 888.8944 907.7448 915.0932 931.0610 947.6037 957.6837 963.0371 983.5299 986.1243 989.5185 1002.8235 1015.7217 1020.9770 1028.2550 1033.3995 1043.5344 1061.3136 1067.3669 1081.7932 1111.2872 1112.5466 1119.6328 1135.0811 1139.5534 1162.4771 1169.8292 1173.4443 1191.1947 1200.1910 1214.8242 1221.8521 1234.7411 1249.5903 1262.5173 1271.7683 1303.1382 1309.3842 1310.0502 1312.7624 1320.9544 1341.3455 1347.4099 1352.3899 1360.4116 1360.8249 1384.1608 1429.2439 1435.5445 1444.3932 1449.5520 1459.1042 1460.2441 1479.7534 1498.7263 1591.8989 1610.3757 1649.5730 2953.6119 2996.2854 3015.3042 3023.1138 3035.3122 3044.0360 3061.8396 3068.1965 3072.5085 3077.4954 3084.7748 3113.6479 3121.9966 3124.0723 3131.3031 3143.6741 3144.0570 3160.6446 3184.3601 3503.3699 3544.0276
redmass: 4.5652 5.3508 4.0213 5.1603 6.7857 5.8414 4.7864 5.7519 1.2604 2.5133 4.5636 3.0209 4.2343 3.6494 4.7143 2.8680 4.4910 4.2849 5.6930 6.0542 3.0276 3.2597 2.8428 2.9440 3.4741 2.1226 1.8841 3.5778 3.7285 4.0047 1.2344 6.2928 6.4075 4.6517 4.8081 4.4656 6.4191 1.7472 5.0736 3.6991 1.9623 6.2868 4.8342 3.2339 2.9360 2.1628 1.2909 3.1347 1.9806 2.7138 3.9659 1.5431 1.6130 1.4952 4.2036 1.4080 3.0539 6.0654 1.3294 2.8488 2.1424 2.2863 2.5739 1.2696 1.8890 2.3963 1.9474 3.4782 1.3184 2.4032 1.3222 3.1352 1.8689 1.3772 1.0900 1.1912 1.7849 1.6736 1.4471 1.4667 1.5304 1.4260 1.4487 1.4047 1.3959 1.6242 2.0552 1.2729 1.3355 1.5988 1.5184 1.4770 1.3048 8.4030 1.1897 2.2008 1.0826 1.0864 1.0528 1.0888 2.2575 1.0481 6.2732 6.1012 11.9980 1.0351 1.0636 1.0596 1.0855 1.0586 1.0988 1.0893 1.0900 1.0976 1.0996 1.1027 1.1071 1.0857 1.0882 1.0886 1.0994 1.0941 1.0993 1.0951 1.0650 1.0656
irintensity: 0.0697 0.2347 0.0646 0.7027 1.7409 1.1603 4.3288 0.1089 0.5981 1.5726 3.1537 4.4852 1.2184 6.6373 0.4961 3.4693 7.9568 4.6699 9.6127 0.4704 7.0431 5.0607 0.3749 19.5806 7.7671 13.9266 19.8803 18.6513 5.4037 5.1298 179.6436 47.4834 0.2548 28.1484 49.2556 2.1554 4.3856 77.2360 0.3520 2.6690 31.5117 2.3919 0.5793 71.0403 1.6757 1.7355 0.4322 21.2292 4.8738 34.9358 32.8766 11.9477 1.8319 9.0396 94.1531 0.4941 26.9188 3.3520 1.1639 123.6927 24.2925 20.8766 190.0287 3.2898 28.3903 63.4525 140.7985 19.2405 0.4357 9.4033 1.0666 25.9899 34.4731 5.2596 1.3130 3.8499 0.6869 12.4890 2.7798 1.1676 0.9782 12.7376 7.1407 3.1428 2.8694 34.7674 1.9608 26.2167 26.4453 8.3063 3.4703 3.7016 12.2038 1.6583 6.1726 15.9955 9.1880 8.2336 13.4456 5.0423 23.1401 8.2643 0.5517 6.8210 147.8501 91.6679 34.5187 15.4888 8.7897 22.1267 28.6973 15.0859 14.3006 53.8313 7.2863 19.7602 12.8851 3.0710 12.8387 4.5370 18.7727 35.9154 24.3869 5.6982 30.2265 13.0454
temp: 298.150 k
press: 1.00000 atm
elementType: 8 8 8 8 8 7 6 6 6 6 6 6 6 6 6 6 6 6 6 6 6 6 6 1 1 1 1 1 1 1 1 1 1 1 1 1 1 1 1 1 1 1 1 1
symmnumber: 1
zpe: 930280.1 jmol-1
zpe.correction: 0.354325 hartree
zpe.thermalcorrener: 0.374687 hartree
zpe.thermalcorrenthalpy: 0.375631 hartree
zpe.thermalcorrgfe: 0.304982 hartree
zpe.sumelectzpe: -1089.474300 hartree
zpe.sumelectthermal: -1089.453939 hartree
zpe.sumelectthermalent: -1089.452995 hartree
zpe.sumelectthermalfe: -1089.523643 hartree
dipole: -1.5333 1.1714 -2.4209
dipole: 3.0958
quadrupole: -145.6807 -128.3581 -139.9389
quadrupole: 10.7895 4.2378 -0.0728
quadrupole: -7.6882 9.6344 -1.9463 10.7895 4.2378 -0.0728
hfenergy: -1089.8286254 hartree
pointgroup: C01 [X(C17H21N1O5)]
dipole: 0.4999374 -0.6466046 -0.9030237 debye
polarizability: 224.3077839|8.6668363|199.2908575|-30.5612005|-3.2853214|162.9818482 unknown
InChI: InChI=1S/C17H21NO5/c1-18-12-7-11(8-13(18)15-14(12)23-15)22-16(20)17(21,9-19)10-5-3-2-4-6-10/h2-6,11-15,19,21H,7-9H2,1H3
charge 0 multiplicity 1
44 atoms
O  5.336475 0.151406 0.560052
O  -0.108682 0.79545 -0.45688
O  -0.564309 1.411662 1.749892
O  -3.174459 2.17234 0.878143
O  -1.978507 2.811142 -1.634191
N  3.466894 -1.137356 -0.945517
C  3.92015 0.07018 1.091738
C  4.228704 0.973241 -0.064362
C  3.095533 -1.099117 0.501498
C  3.576953 0.308159 -1.300372
C  1.58667 -0.721164 0.570222
C  2.121644 0.847812 -1.439928
C  1.352305 0.650964 -0.112883
C  4.58641 -2.023431 -1.342763
C  -0.968141 1.14623 0.603247
C  -2.454729 1.148191 0.13027
C  -2.569008 1.485974 -1.381629
C  -3.077409 -0.218085 0.444151
C  -4.159839 -0.313392 1.349833
C  -2.579275 -1.39014 -0.181499
C  -4.747787 -1.570206 1.617034
C  -3.170774 -2.643641 0.088244
C  -4.258487 -2.737685 0.987256
H  3.781199 0.418971 2.120621
H  4.342815 2.059501 0.021389
H  3.289213 -2.071637 0.982962
H  4.146579 0.441828 -2.234545
H  1.02315 -1.501364 0.029586
H  1.222404 -0.680622 1.612687
H  2.113628 1.91874 -1.721718
H  1.627354 0.272333 -2.241268
H  1.584318 1.461093 0.603005
H  4.68394 -1.994772 -2.44357
H  4.329156 -3.061301 -1.063032
H  5.560952 -1.757669 -0.886816
H  -2.107155 0.710254 -2.015329
H  -3.638334 1.588109 -1.625463
H  -2.905982 3.049665 0.492521
H  -4.523684 0.598414 1.829505
H  -1.72682 -1.329795 -0.868554
H  -0.993856 2.697017 -1.680899
H  -5.586699 -1.637197 2.318803
H  -2.783436 -3.544489 -0.400906
H  -4.716775 -3.71081 1.196565
