program: Gaussian 09
title: 000016475
version: EM64L-G09RevD.01
frameworkgroup: C1[X(C14H12N2O4)]
method: RPBEPBE
basis: SDD
operation: Freq
keyword: #p
keyword: freq=noraman
keyword: PBEPBE/SDD
title: #p freq=noraman PBEPBE/SDD
converged: YES YES NO NO
title: Mulliken charges:
elementType: O O O O N N C C C C C C C C C C C C C C H H H H H H H H H H H H
charge: -0.439407 -0.439407 -0.319909 -0.319910 -0.677265 -0.677265 0.393831 0.393830 -0.496652 -0.496652 -0.378993 -0.378992 0.099081 0.099081 0.329012 0.329012 -0.424657 -0.424657 0.118120 0.118120 0.282125 0.282124 0.232805 0.232804 0.220164 0.220164 0.374215 0.303517 0.374215 0.303517 0.384014 0.384014
chargesum: 0.00000
title: Mulliken charges with hydrogens summed into heavy atoms:
elementType: O O O O N N C C C C C C C C C C C C C C
charge: -0.055393 -0.055393 -0.319909 -0.319910 0.000467 0.000467 0.393831 0.393830 -0.214527 -0.214528 -0.146188 -0.146188 0.099081 0.099081 0.329012 0.329012 -0.204493 -0.204493 0.118120 0.118120
polarizability: 3.29802226e+02 4.49939905e-05 2.11034805e+02 -1.11316855e+01 -4.25764677e-05 8.30538234e+01
1716.lowfreq: -5.8694 -0.0007 -0.0003 0.0007 0.5869 3.4500 28.8758 47.4242 58.7876
frequency: 28.8752 47.4234 58.7876 88.3609 101.4788 138.6574 141.7860 171.0913 177.8583 235.1611 265.0337 268.1832 331.8126 358.6703 388.3188 403.0230 411.8840 413.2041 418.7887 419.9022 465.4065 465.5697 499.4979 509.5034 533.7430 555.6325 565.4072 578.2325 594.0364 621.4307 623.7931 670.5359 692.2248 706.4127 722.7048 725.2742 739.4461 771.3009 774.9070 776.9171 818.9439 828.7476 845.5975 897.7577 925.7898 938.6190 957.6920 960.1832 1003.6227 1010.3535 1042.8547 1051.2764 1059.4233 1140.9795 1144.2561 1173.0849 1180.4791 1275.6351 1288.1066 1306.3305 1320.5687 1322.9626 1337.0944 1348.5867 1374.1562 1392.8436 1432.4443 1434.3187 1494.9663 1509.7957 1552.0309 1558.4359 1575.7007 1575.8768 1628.2067 1628.3618 1645.9956 1648.9351 3118.7152 3121.2682 3142.9433 3146.5031 3165.4010 3169.8711 3409.8759 3410.7477 3534.6733 3534.7603 3648.5175 3648.5794
redmass: 6.0330 6.5893 7.3206 9.0577 7.3880 5.0090 5.3100 5.0074 7.0983 5.7429 6.8069 5.3066 4.9772 5.2029 4.8726 6.5769 5.5776 5.4728 2.7959 2.8204 1.2148 1.2003 4.1277 3.7542 3.2201 1.5412 3.1896 1.5299 1.8885 4.5477 4.7309 6.6729 5.3016 3.4413 1.2010 1.3402 5.6874 3.4133 3.3982 4.8303 1.5350 1.6149 6.2701 5.7192 1.4393 1.5808 1.3543 1.3702 4.7381 3.9431 1.8799 1.6233 1.9249 1.5707 1.7478 1.1709 1.2204 2.1058 1.5151 1.4513 2.9512 2.6019 2.4839 2.7674 7.5032 6.9353 4.9300 7.1676 2.7536 2.7409 3.1138 4.3602 6.2992 3.9335 1.6640 1.7024 6.3666 6.6391 1.0866 1.0868 1.0969 1.0959 1.0916 1.0909 1.0553 1.0556 1.0640 1.0641 1.0951 1.0951
irintensity: 0.0050 0.4902 0.0382 0.0924 3.6863 1.9196 0.0031 0.6445 1.1393 0.7323 0.2919 6.3561 3.7031 19.7583 0.0222 12.4559 1.0966 2.7169 69.8249 5.0141 10.8699 167.0945 10.2704 10.9832 9.1465 3.0429 51.2579 260.9327 12.7649 26.2792 83.5894 0.3363 9.8117 3.0305 215.6509 8.3895 8.0267 4.3668 90.5430 3.6108 74.2351 5.9091 0.7171 8.4282 11.1888 0.1120 4.7859 0.5172 42.7890 395.2945 3.9369 34.3644 7.4345 320.3162 30.0745 39.4516 27.9077 0.6397 7.7641 18.8756 99.7262 11.8705 23.4862 80.9970 63.2507 1.7331 0.1735 0.9734 64.5260 62.9531 667.8530 82.3665 374.3945 5.5823 72.9213 82.3664 39.3449 555.0880 31.4685 2.8662 5.8692 34.7860 6.3310 1.5604 232.5815 79.3130 11.3696 95.5340 28.6416 80.0245
temp: 298.150 k
press: 1.00000 atm
elementType: 8 8 8 8 7 7 6 6 6 6 6 6 6 6 6 6 6 6 6 6 1 1 1 1 1 1 1 1 1 1 1 1
symmnumber: 1
zpe: 628895.7 jmol-1
zpe.correction: 0.239534 hartree
zpe.thermalcorrener: 0.256771 hartree
zpe.thermalcorrenthalpy: 0.257715 hartree
zpe.thermalcorrgfe: 0.194201 hartree
zpe.sumelectzpe: -949.747731 hartree
zpe.sumelectthermal: -949.730494 hartree
zpe.sumelectthermalent: -949.729549 hartree
zpe.sumelectthermalfe: -949.793064 hartree
dipole: 0.0000 -2.6591 0.0000
dipole: 2.6591
quadrupole: -105.1729 -92.2809 -119.1862
quadrupole: 0.0000 -5.4634 0.0000
quadrupole: 0.3738 13.2658 -13.6396 0.0000 -5.4634 0.0000
hfenergy: -949.9872645 hartree
pointgroup: C01 [X(C14H12N2O4)]
dipole: -0.0000003 1.0461576 -0.0000093 debye
polarizability: 329.4741562|0.0006701|211.0348049|14.3093504|-0.0004003|83.3818933 unknown
InChI: InChI=1S/C14H12N2O4/c15-11-3-1-7(5-9(11)13(17)18)8-2-4-12(16)10(6-8)14(19)20/h1-6,17,19H,15-16H2
charge 0 multiplicity 1
32 atoms
O  2.893027 -2.66856 -0.692711
O  -2.892993 -2.668591 0.692719
O  4.947518 -1.7104 -0.232902
O  -4.947496 -1.710456 0.23292
N  4.99637 0.879939 0.486319
N  -4.996379 0.87988 -0.486317
C  0.740963 0.822813 0.06674
C  -0.74097 0.822805 -0.066745
C  1.509148 -0.333055 -0.178899
C  -1.509143 -0.33307 0.178907
C  1.449751 2.003326 0.457539
C  -1.449772 2.003305 -0.457556
C  2.925401 -0.350041 -0.045152
C  -2.925397 -0.350072 0.045162
C  3.624753 0.850876 0.347037
C  -3.624761 0.850833 -0.347038
C  2.841101 2.022088 0.592561
C  -2.841122 2.022051 -0.592576
C  3.685199 -1.574461 -0.314388
C  -3.685179 -1.574497 0.314415
H  1.024877 -1.257376 -0.506869
H  -1.024862 -1.257382 0.506888
H  0.888813 2.91651 0.688125
H  -0.888844 2.916492 -0.688155
H  3.347975 2.942983 0.904917
H  -3.348007 2.942937 -0.904942
H  5.519557 0.015402 0.303899
H  5.467125 1.738265 0.760474
H  -5.519556 0.015338 -0.303894
H  -5.467143 1.738199 -0.76048
H  3.49421 -3.444669 -0.850171
H  -3.494165 -3.44471 0.850176
