program: Gaussian 09
title: 000181068
version: EM64L-G09RevD.01
frameworkgroup: C1[X(C8H13NO)]
method: RPBEPBE
basis: SDD
operation: Freq
keyword: #p
keyword: freq=noraman
keyword: PBEPBE/SDD
title: #p freq=noraman PBEPBE/SDD
converged: NO YES NO NO
title: Mulliken charges:
elementType: O N C C C C C C C C H H H H H H H H H H H H H
charge: -0.468722 -0.026762 -0.026174 -0.077096 -0.451777 -0.448508 -0.402662 -0.394163 -0.493578 -0.163335 0.240034 0.182494 0.241389 0.192695 0.188554 0.218699 0.200734 0.207974 0.196248 0.208869 0.299087 0.235940 0.340059
chargesum: 0.00000
title: Mulliken charges with hydrogens summed into heavy atoms:
elementType: O N C C C C C C C C
charge: -0.128662 -0.026762 0.213860 0.105398 -0.017693 -0.041255 0.006046 0.010954 0.041449 -0.163335
polarizability: 1.07475802e+02 6.67944118e+00 8.94050281e+01 3.46361592e+00 1.75422327e+00 7.05297794e+01
1716.lowfreq: -23.0386 -3.5122 -0.0010 -0.0007 -0.0002 13.0047 62.4143 93.0143 130.8718
frequency: 62.2742 92.9842 130.8489 178.0473 238.4343 282.9844 308.2852 331.4008 348.5476 371.9587 409.2388 424.2211 463.5913 536.7264 572.5175 781.1433 814.4790 832.0983 870.5811 895.8448 925.2737 936.9328 960.7400 1012.4556 1049.4009 1057.8428 1069.3079 1099.4544 1113.0539 1130.1984 1158.5451 1195.3327 1234.3508 1249.8920 1260.0339 1277.8435 1300.8797 1313.7799 1328.2891 1331.3423 1340.1917 1344.6851 1347.0206 1394.9376 1447.9729 1464.0116 1464.5515 1469.6586 1475.7646 2194.3284 2912.1451 2962.9313 2967.4659 2974.6554 2977.0917 2983.6753 2999.2496 3029.3634 3038.7297 3040.1860 3050.7129 3059.7885 3565.9308
redmass: 4.3331 4.2164 4.0092 2.2895 4.8134 1.0938 1.6737 4.5585 2.3993 2.9683 3.8480 3.8101 3.2033 2.2497 3.0925 2.0826 1.7106 1.9997 2.1588 1.6769 1.7666 4.1237 2.0770 3.5456 1.6966 1.5490 2.3323 1.7429 2.0423 1.8487 1.3382 1.3127 1.3059 1.2420 1.3028 1.2854 1.2691 1.2016 1.3463 1.3604 1.4454 1.4598 1.5096 1.6398 1.0862 1.0907 1.0918 1.0840 1.0960 12.4196 1.0826 1.0655 1.0604 1.0659 1.0613 1.0661 1.0780 1.0996 1.0955 1.0990 1.1029 1.0974 1.0662
irintensity: 3.4628 1.4115 5.8204 0.5688 6.4598 135.0900 1.9216 6.9804 7.9944 0.5260 5.6902 3.3061 1.2028 9.1028 3.8895 0.5292 3.9982 14.1240 4.4281 2.8009 7.6724 13.4081 20.1430 68.9962 0.5657 4.9771 1.9941 0.3556 1.0059 6.7225 30.3295 1.9940 11.1646 0.9986 5.8335 9.7674 3.7070 3.6715 8.1068 4.1842 0.3748 1.6258 4.9911 1.3057 17.6354 9.6321 5.4284 20.7776 3.0325 18.2967 45.1963 27.0007 32.3955 34.8162 34.1516 1.0987 34.3155 41.6060 25.7283 38.0978 89.1789 14.5882 3.2133
temp: 298.150 k
press: 1.00000 atm
elementType: 8 7 6 6 6 6 6 6 6 6 1 1 1 1 1 1 1 1 1 1 1 1 1
symmnumber: 1
zpe: 517122.9 jmol-1
zpe.correction: 0.196962 hartree
zpe.thermalcorrener: 0.207149 hartree
zpe.thermalcorrenthalpy: 0.208093 hartree
zpe.thermalcorrgfe: 0.161526 hartree
zpe.sumelectzpe: -441.823308 hartree
zpe.sumelectthermal: -441.813121 hartree
zpe.sumelectthermalent: -441.812177 hartree
zpe.sumelectthermalfe: -441.858744 hartree
dipole: 5.5638 1.1240 1.7047
dipole: 5.9266
quadrupole: -76.5182 -59.9056 -60.0609
quadrupole: -2.3386 -3.3508 1.3517
quadrupole: -11.0233 5.5893 5.4340 -2.3386 -3.3508 1.3517
hfenergy: -442.02027 hartree
pointgroup: C01 [X(C8H13N1O1)]
dipole: 2.209581 0.2881063 0.6867641 debye
dipolederiv: -0.2977258 0.1273149 0.1241514 0.101809 -0.9111025 0.055846 0.1533793 0.0868472 -0.4992359 -0.3831834 0.0015865 -0.0063617 -0.0785093 -0.2453958 -0.0013244 -0.0693842 0.0027431 -0.2454999 0.1529788 -0.0715227 -0.0010067 -0.0897343 -0.0012664 -0.0174605 -0.06187 -0.046377 0.1008749 0.2608163 -0.0122871 -0.034533 0.0409086 0.6907177 -0.0724828 -0.0162386 -0.0337899 0.4107902 -0.0366851 -0.0054846 0.0311366 0.0266534 0.0377435 -0.0061546 0.0286245 -0.0320376 0.1524347 -0.0124825 0.1267634 0.0405459 0.012926 -0.0774221 0.0276259 0.0102435 0.0119388 0.0943194 0.0598926 0.0054987 0.0057661 0.0194947 0.0556712 -0.0192113 -0.0183699 0.0254793 0.1466057 0.0567631 -0.0012573 -0.0153726 -0.028618 0.0656994 -0.0000136 0.0312296 -0.0354756 0.1564183 -0.0936436 -0.0311552 -0.0355343 -0.0639601 0.0319641 -0.0526551 -0.0277891 -0.0375942 0.2161239 0.1917111 0.0908764 0.0862886 0.190853 0.0017599 0.0356965 0.1623534 0.0238745 -0.0347441 0.0459411 -0.0031586 0.0167359 0.0143404 0.0475638 -0.0002294 0.0058098 0.0106303 -0.1326134 0.0015846 0.0101818 0.0020205 -0.0007566 -0.0311784 0.0315523 -0.0059175 0.0330397 -0.2364839 -0.0882784 -0.1003344 -0.0322385 -0.0992895 -0.0000702 -0.0170592 -0.0516913 -0.0310026 0.0643601 0.065753 0.0305665 -0.0111768 0.0259261 0.0414132 -0.035329 0.0244597 0.0254416 -0.1829821 -0.1327449 -0.1185736 -0.0355063 -0.1363333 -0.0759584 -0.0341777 -0.055735 -0.0659543 0.0573293 0.0641521 0.0254913 -0.0416069 0.0201234 0.0545325 0.0061192 0.0227238 0.0263612 -0.1510053 0.0182383 -0.0082997 -0.0162393 -0.012183 0.08769 0.0225986 -0.0012633 -0.0485643 -0.1799954 0.0225272 0.0262716 -0.0029995 0.0404418 -0.2016679 0.0511226 -0.0075137 0.083646 0.0628458 0.0757609 -0.0271066 0.0011915 -0.0256292 0.0298309 -0.0061863 -0.0698411 0.0276991 -0.18822 -0.1634302 0.0918004 0.0651521 0.0894413 -0.0040785 -0.0255971 0.0978478 -0.0394028 0.0524356 0.1148756 0.0367326 -0.021393 0.0644601 0.0089344 0.0132868 -0.0438697 0.0262563 0.1021874 0.0412773 -0.0219884 -0.0384795 -0.0338309 0.1073635 0.035146 0.001701 -0.0135373 -0.0865326 0.0359016 -0.171916 -0.0805406 -0.0785335 0.2872563 0.0088873 -0.108889 -0.0002216 0.3205874 unknown
polarizability: 108.2428159|5.3666315|88.5622571|3.851385|1.7240127|70.6055366 unknown
InChI: InChI=1S/C8H13NO/c9-6-5-7-3-1-2-4-8(7)10/h7-8,10H,1-5H2
charge 0 multiplicity 1
23 atoms
O  0.792095 2.366744 -0.196839
N  -3.712891 -0.399459 -0.405029
C  -0.199812 0.161688 -0.128326
C  1.028634 0.99371 0.294031
C  -0.023146 -1.312753 0.313815
C  2.335211 0.399899 -0.271408
C  1.286869 -1.921495 -0.23893
C  2.514805 -1.073441 0.169067
C  -1.49434 0.807337 0.447487
C  -2.723162 0.144487 -0.018031
H  -0.257697 0.203149 -1.234952
H  1.092572 1.002297 1.408215
H  -0.893896 -1.905449 -0.023939
H  -0.013357 -1.363556 1.4233
H  3.199878 1.008789 0.064548
H  2.299287 0.46278 -1.377327
H  1.227851 -1.973102 -1.345202
H  1.402363 -2.95976 0.125496
H  2.641123 -1.118558 1.270573
H  3.438592 -1.488878 -0.275682
H  -1.519364 1.873318 0.157153
H  -1.47111 0.768312 1.555199
H  1.603995 2.911938 -0.04112
