program: Gaussian 09
title: 000181032
version: EM64L-G09RevD.01
frameworkgroup: C1[X(C16H17BrN2O)]
method: RPBEPBE
basis: SDD
operation: Freq
keyword: #p
keyword: freq=noraman
keyword: PBEPBE/SDD
title: #p freq=noraman PBEPBE/SDD
converged: YES YES NO NO
title: Mulliken charges:
elementType: Br O N N C C C C C C C C C C C C C C C C H H H H H H H H H H H H H H H H H
charge: 0.012504 -0.431885 -0.111294 -0.385261 -0.164388 0.367500 -0.583793 -0.159330 -0.449413 0.526975 0.237290 -0.202007 -0.408220 0.233169 -0.359365 -0.641331 -0.447293 -0.432000 -0.367708 -0.200669 0.206411 0.224528 0.252719 0.223818 0.214714 0.181954 0.256912 0.193487 0.220982 0.189650 0.222567 0.237583 0.236663 0.322591 0.232368 0.218176 0.331396
chargesum: 0.00000
title: Mulliken charges with hydrogens summed into heavy atoms:
elementType: Br O N N C C C C C C C C C C C C C C C C
charge: 0.012504 -0.100489 -0.111294 -0.062670 0.042024 0.367500 -0.106546 0.064489 -0.052744 0.526975 0.237290 -0.202007 -0.151308 0.233169 0.055105 0.008469 -0.447293 -0.195337 -0.135341 0.017506
polarizability: 2.93969919e+02 6.26916763e+00 2.35972586e+02 -5.14739850e+00 6.31655899e+00 1.10355431e+02
1716.lowfreq: -5.4385 -0.0007 -0.0006 -0.0006 6.1561 8.1577 24.0477 68.6351 79.5964
frequency: 23.8956 68.6244 79.5960 93.1622 97.1764 114.8545 130.5785 161.5380 193.0536 222.0416 233.3089 252.1000 266.6737 271.7082 303.2612 310.3287 326.3478 334.2425 381.7120 398.1187 447.0901 462.7314 469.1011 483.2474 513.7672 530.1321 555.3492 581.4267 601.4760 607.1488 621.0477 660.1937 738.8111 745.1182 761.3143 784.0152 817.9643 849.5757 873.4569 884.7918 893.6145 908.6003 953.0904 957.6902 967.7853 989.7797 1008.6834 1041.4876 1047.8956 1053.3345 1061.7474 1097.0842 1105.6251 1107.3340 1137.8095 1146.4338 1154.9164 1173.6158 1177.5369 1187.4751 1226.4589 1239.5765 1259.2593 1267.1975 1282.9009 1290.7522 1295.9670 1306.9310 1314.8956 1321.5530 1343.9175 1355.5219 1371.3747 1378.0318 1395.0922 1419.8536 1434.4224 1440.1827 1458.4633 1466.5684 1468.9920 1476.6481 1482.7864 1494.7683 1576.6473 1611.4513 1622.8342 1663.9016 2796.8448 2833.7739 2862.4214 2930.4894 2949.7306 2984.4341 3019.8530 3034.7312 3053.6625 3073.7337 3090.6349 3114.5105 3127.6843 3144.3562 3160.3088 3557.6347 3614.9149
redmass: 5.7289 4.3075 5.0809 5.1026 7.2553 3.0794 2.7136 1.7579 1.6952 2.8941 4.1198 5.7567 4.1749 4.4022 3.1786 3.1741 1.8956 2.4427 3.8276 3.9997 3.9430 1.3892 2.6147 3.4301 3.0937 3.9013 3.7937 4.6985 4.7701 4.5235 5.1405 3.3027 4.8119 1.9182 3.6272 2.3753 4.6314 4.7568 1.3736 1.5363 3.9825 1.8347 2.0100 1.4097 3.8879 2.2812 2.6284 2.2999 2.1595 2.3854 2.3435 2.4803 3.0114 1.3895 2.8306 1.4858 1.5131 1.3523 2.2126 1.2803 2.5904 1.5506 1.7182 1.2532 1.4193 2.0662 1.4851 1.7416 1.4064 2.1038 1.4590 1.6770 1.3565 1.3719 2.9461 3.2169 1.1920 4.1995 1.1318 1.0929 1.0779 1.0799 1.0517 3.2844 9.7444 8.3726 7.8876 8.7094 1.0786 1.0697 1.0577 1.0810 1.0686 1.0630 1.0881 1.0736 1.0971 1.0956 1.0992 1.0904 1.0858 1.0918 1.0984 1.0661 1.0809
irintensity: 0.1242 2.0807 2.8292 0.8561 1.1829 1.5499 3.8359 0.2139 1.5835 6.4774 3.8704 7.6177 2.5758 1.8782 1.1547 17.7288 100.3560 63.8555 15.9498 3.6020 3.8817 73.6232 33.3557 6.6449 11.0536 4.3771 3.5190 5.1096 7.3799 2.8470 5.5147 2.8037 10.7612 39.3103 3.1576 48.4315 8.2151 2.2044 17.7200 7.5185 18.4559 0.8633 10.1933 0.8441 97.9279 5.7024 26.9469 7.0191 0.3484 9.3390 44.2266 2.9450 17.2072 3.6045 23.4015 23.2524 3.1473 1.6893 19.6673 2.1130 7.9158 2.9632 5.3531 1.9791 13.9030 13.6959 7.7099 14.8386 20.6131 22.1201 7.3510 1.7065 30.1265 5.7267 97.2418 11.3761 3.7636 63.2637 26.1523 0.8918 4.0209 13.3125 23.1283 1.5882 22.9907 11.0869 8.2031 3.1265 49.4758 75.5714 154.1326 42.4186 102.3072 20.9571 55.2483 44.6315 26.2781 29.3232 29.4403 13.4899 2.5547 11.5939 30.9731 6.5365 84.9504
temp: 298.150 k
press: 1.00000 atm
elementType: 35 8 7 7 6 6 6 6 6 6 6 6 6 6 6 6 6 6 6 6 1 1 1 1 1 1 1 1 1 1 1 1 1 1 1 1 1
symmnumber: 1
zpe: 777801.7 jmol-1
zpe.correction: 0.296249 hartree
zpe.thermalcorrener: 0.314127 hartree
zpe.thermalcorrenthalpy: 0.315071 hartree
zpe.thermalcorrgfe: 0.249861 hartree
zpe.sumelectzpe: -816.614028 hartree
zpe.sumelectthermal: -816.596151 hartree
zpe.sumelectthermalent: -816.595207 hartree
zpe.sumelectthermalfe: -816.660417 hartree
dipole: -0.7051 -1.2425 0.3436
dipole: 1.4694
quadrupole: -119.4992 -117.9780 -128.3166
quadrupole: -17.8863 -3.5768 -0.6033
quadrupole: 2.4321 3.9533 -6.3854 -17.8863 -3.5768 -0.6033
hfenergy: -816.9102775 hartree
pointgroup: C01 [X(C16H17Br1N2O1)]
dipole: 0.1265789 0.5507463 0.1219026 debye
polarizability: 285.8350557|21.259308|244.03684|3.2534055|-7.6300495|110.426039 unknown
InChI: InChI=1S/C16H17BrN2O/c1-19-7-9(8-20)5-11-10-3-2-4-13-15(10)12(6-14(11)19)16(17)18-13/h2-5,9,14,18,20H,6-8H2,1H3
charge 0 multiplicity 1
37 atoms
Br 4.123771 2.860763 -0.411386
O  -4.796226 -2.03626 -0.718423
N  -1.927381 1.977538 0.062174
N  3.825948 0.00001 -0.024106
C  -0.691166 1.200078 0.355989
C  -0.854656 -0.29438 -0.008389
C  0.537073 1.864866 -0.363167
C  -3.340488 -0.018898 -0.388258
C  -3.164515 1.259962 0.452845
C  1.761142 1.010089 -0.18792
C  0.380822 -1.113562 0.083471
C  1.602922 -0.404935 0.012494
C  -2.059217 -0.81799 -0.373778
C  2.880076 -1.031072 0.103381
C  -4.534751 -0.85918 0.124766
C  -1.89823 3.340809 0.635152
C  3.132575 1.220172 -0.198045
C  0.482446 -2.515016 0.255045
C  2.978717 -2.430467 0.268861
C  1.758149 -3.146923 0.338938
H  -0.465853 1.231031 1.458193
H  0.707452 2.880048 0.036693
H  0.276832 1.973873 -1.434889
H  -3.567833 0.290592 -1.433655
H  -4.019732 1.942107 0.287552
H  -3.163221 0.985889 1.541266
H  -2.13917 -1.874298 -0.662913
H  -5.44168 -0.220347 0.202005
H  -4.314054 -1.28124 1.119903
H  -1.766625 3.347815 1.746993
H  -2.847871 3.852426 0.399531
H  -1.084841 3.936626 0.190152
H  -0.420839 -3.127588 0.348788
H  4.838891 -0.093185 -0.002312
H  3.939107 -2.951027 0.343783
H  1.796627 -4.233747 0.475123
H  -5.007801 -1.728079 -1.636058
