program: Gaussian 09
title: 000181027
version: EM64L-G09RevD.01
frameworkgroup: C1[X(C16H22O8)]
method: RPBEPBE
basis: SDD
operation: Freq
keyword: #pfreq=noraman
keyword: PBEPBE/SDD
title: #p freq=noraman PBEPBE/SDD
converged: YES YES NO NO
title: Mulliken charges:
elementType: O O O O O O O O C C C C C C C C C C C C C C C C H H H H H H H H H H H H H H H H H H H H H H
charge: -0.278984 -0.289990 -0.433685 -0.428332 -0.417206 -0.454813 -0.435099 -0.218809 -0.070065 -0.230020 -0.126655 -0.112564 -0.146328 -0.296799 0.280913 -0.514260 0.546200 0.123845 -0.557985 -0.455104 -0.346707 -0.509917 0.233472 -0.769544 0.180866 0.296300 0.292854 0.223860 0.302222 0.188704 0.240585 0.354252 0.334114 0.333135 0.368257 0.246713 0.239620 0.224551 0.241092 0.220756 0.284912 0.235713 0.365927 0.254024 0.235375 0.244604
chargesum: 0.00000
title: Mulliken charges with hydrogens summed into heavy atoms:
elementType: O O O O O O O O C C C C C C C C C C C C C C C C
charge: -0.278984 -0.289990 -0.079433 -0.094218 -0.084071 -0.086556 -0.069171 -0.218809 0.110801 0.066280 0.166199 0.111295 0.155894 0.132490 0.280913 -0.267547 0.546200 0.123845 -0.093813 -0.214012 -0.125951 0.010708 0.233472 -0.035541
polarizability: 2.44477363e+02 -5.39004019e+00 2.14556111e+02 -6.00643100e+00 7.59335214e+00 1.42784379e+02
1716.lowfreq: -7.4070 0.0005 0.0007 0.0009 2.0442 4.0209 17.2571 22.6149 27.1825
frequency: 16.2444 22.4741 26.9110 32.9185 37.3981 61.9467 68.7079 77.7597 83.2817 103.2433 118.2499 141.9819 148.6504 154.4402 176.5275 199.5533 233.0461 236.9752 246.8822 282.5510 295.2804 309.8711 323.5330 335.2637 340.0303 348.1564 352.0491 364.4714 387.9108 418.3456 441.5296 455.9820 458.7738 470.7220 478.7951 487.2155 493.0734 501.5897 531.8616 566.1388 573.0090 578.3245 611.7645 640.6862 717.3176 719.3674 736.9586 751.7243 760.3456 793.9501 799.5234 838.4395 862.3203 888.0044 908.7133 916.0903 931.4620 932.9865 942.7148 952.2807 964.6947 972.7597 1010.2341 1022.2797 1026.5440 1043.8321 1053.5097 1067.0267 1074.8156 1081.4327 1111.5451 1116.5723 1140.5709 1153.7187 1160.0291 1171.0681 1177.7893 1178.2776 1210.7444 1223.9367 1237.3376 1257.8750 1265.4863 1267.2785 1271.8971 1282.4334 1294.6880 1299.5371 1313.0879 1329.6429 1332.4369 1335.7300 1356.0522 1357.4789 1362.6266 1368.9566 1379.3708 1385.6069 1389.4028 1390.1752 1420.5784 1439.6450 1444.5916 1456.6030 1471.8270 1475.0265 1502.8493 1594.9631 1621.8044 1633.7239 2881.6945 2954.8508 2976.2565 2980.5077 2990.2248 3002.4146 3005.8653 3064.0117 3066.8732 3081.2076 3085.5271 3092.7952 3113.7773 3114.5855 3120.4488 3145.1703 3161.9278 3487.5975 3505.6425 3517.1423 3534.8717 3589.5620
redmass: 6.6606 6.2575 3.7245 4.7821 4.2077 2.6197 1.5812 6.3075 5.3606 5.2434 2.5156 4.7869 3.2099 4.6829 4.5205 6.4379 3.9254 4.4525 4.6904 3.5523 3.2877 2.5392 2.0674 2.5806 1.2343 1.6560 3.8751 3.4604 4.2269 3.4961 3.2977 3.9173 4.0724 2.0793 1.8237 2.0786 1.3311 3.3006 2.9712 4.6060 4.0245 4.5824 5.7341 4.5295 3.9181 4.6317 3.4130 1.4558 5.3172 3.2722 1.4816 2.8349 4.8051 1.7272 1.8790 2.5759 4.3903 1.4566 2.3468 3.0036 3.4460 4.0625 4.9132 2.1963 4.3994 1.8378 3.2702 2.9370 2.4386 3.6738 2.4608 2.4097 1.8652 1.3015 1.2853 1.2162 1.5863 1.3630 1.3971 1.9133 1.2750 2.1133 1.8440 1.3149 1.2229 1.2541 1.2190 1.7521 1.2703 1.1675 1.2360 1.2845 1.4198 1.6636 1.1877 1.2424 1.1924 1.5629 4.0424 1.3887 3.4732 1.0717 1.0824 1.0578 1.0960 1.1011 3.0357 6.7817 7.1389 7.3673 1.0819 1.0624 1.0724 1.0383 1.0792 1.0863 1.0702 1.1008 1.0959 1.0951 1.0873 1.0886 1.0861 1.0883 1.1005 1.0954 1.0911 1.0646 1.0651 1.0657 1.0660 1.0663
irintensity: 1.0179 1.1047 2.7297 2.3601 0.3147 1.6851 0.2985 3.6485 1.7450 0.7790 2.8995 1.7413 9.4959 5.7866 3.1046 3.5997 6.8129 13.4011 6.8030 5.8884 22.4050 8.8749 64.0870 42.1874 91.2603 37.4412 33.4528 11.6122 10.4381 1.8234 25.0679 5.0935 8.6555 4.1530 168.9533 39.2108 172.9323 39.1890 4.5543 20.2049 12.8512 7.5271 11.5736 13.3506 1.1616 19.1678 37.1214 3.2826 21.5325 6.1930 43.0530 10.6097 223.4460 19.3157 16.0419 41.5128 149.6433 6.9098 44.0479 28.2433 39.3315 143.1589 9.3822 2.9452 64.6131 11.9377 4.0054 74.7137 82.8633 3.2589 30.0128 8.9896 108.2758 91.3378 7.7919 32.6548 30.0415 26.9700 75.0638 29.5119 12.4831 92.9004 47.6440 9.5507 55.9579 13.0291 22.0570 47.2370 8.7277 5.6679 25.6099 8.0412 13.5822 35.0396 24.3907 63.1658 6.1523 11.5516 18.1308 25.0932 13.5040 6.3028 34.3965 18.3815 18.9838 8.2629 133.1621 18.3023 4.8109 113.7463 63.7277 14.7344 21.7764 4.4552 58.4129 1.4959 21.5802 9.2035 18.3539 20.4291 18.7445 3.8118 3.0221 16.0721 16.0766 16.8445 3.1875 14.2037 17.3187 4.3852 6.9041 47.8396
temp: 298.150 k
press: 1.00000 atm
elementType: 8 8 8 8 8 8 8 8 6 6 6 6 6 6 6 6 6 6 6 6 6 6 6 6 1 1 1 1 1 1 1 1 1 1 1 1 1 1 1 1 1 1 1 1 1 1
symmnumber: 1
zpe: 954975.1 jmol-1
zpe.correction: 0.363731 hartree
zpe.thermalcorrener: 0.389157 hartree
zpe.thermalcorrenthalpy: 0.390101 hartree
zpe.thermalcorrgfe: 0.305859 hartree
zpe.sumelectzpe: -1222.782192 hartree
zpe.sumelectthermal: -1222.756766 hartree
zpe.sumelectthermalent: -1222.755822 hartree
zpe.sumelectthermalfe: -1222.840064 hartree
dipole: -0.6037 0.2486 4.5689
dipole: 4.6153
quadrupole: -167.1423 -119.8822 -146.3468
quadrupole: 21.7780 4.7075 -0.1871
quadrupole: -22.6852 24.5749 -1.8897 21.7780 4.7075 -0.1871
hfenergy: -1223.1459227 hartree
pointgroup: C01 [X(C16H22O8)]
dipole: -0.0949573 -0.2041134 -1.801787 debye
polarizability: 240.8449247|9.7423134|217.6748575|11.0454641|6.3116523|143.2980716 unknown
InChI: InChI=1S/C16H22O8/c1-8(18)2-3-9-4-5-10(19)11(6-9)23-16-15(22)14(21)13(20)12(7-17)24-16/h4-6,12-17,19-22H,2-3,7H2,1H3
charge 0 multiplicity 1
46 atoms
O  -1.643471 0.287119 -1.524903
O  -1.179455 -0.935327 0.51142
O  -5.114581 0.125685 0.87839
O  -3.808461 2.646307 0.520289
O  -4.097495 -1.8142 -1.516292
O  0.316102 2.190096 -1.33271
O  -0.644808 -3.566889 -0.250162
O  5.351667 2.358786 1.264339
C  -4.124167 0.295179 -0.177088
C  -3.103516 1.381516 0.214584
C  -3.44336 -1.070112 -0.433685
C  -2.051475 1.586734 -0.89174
C  -1.935834 -0.924488 -0.752323
C  -0.786214 2.308739 -0.378294
C  0.165263 -1.391055 0.404861
C  1.215728 -0.513631 0.718915
C  2.572157 -0.924958 0.661291
C  0.452258 -2.736804 0.044041
C  3.679315 0.079684 0.939782
C  2.844069 -2.266039 0.301188
C  1.795835 -3.166135 -0.001656
C  3.75519 1.17134 -0.155814
C  4.740116 2.297226 0.163659
C  4.943072 3.344377 -0.926891
H  -4.619048 0.625806 -1.124586
H  -2.629018 1.112296 1.172451
H  -3.560972 -1.705847 0.455667
H  -2.490706 2.155204 -1.73738
H  -1.617452 -1.753666 -1.403313
H  -0.507287 1.89076 0.609985
H  -0.986344 3.386367 -0.259725
H  -5.353074 1.033399 1.208247
H  -4.195395 3.012949 -0.318709
H  -4.060579 -1.269661 -2.345276
H  0.280471 1.257905 -1.681832
H  0.966673 0.509245 1.017314
H  3.522055 0.579962 1.913785
H  4.656457 -0.430415 1.014486
H  3.881778 -2.614818 0.25422
H  2.026217 -4.204991 -0.272094
H  2.758145 1.633114 -0.32343
H  4.029163 0.727444 -1.135571
H  -0.351308 -4.493537 -0.431322
H  5.463853 4.224734 -0.519056
H  5.559834 2.916329 -1.741503
H  3.9788 3.646167 -1.374659
