program: Gaussian 09
title: 000180955
version: EM64L-G09RevD.01
frameworkgroup: C1[X(C20H18N2O2)]
method: RPBEPBE
basis: SDD
operation: Freq
keyword: #p
keyword: freq=noraman
keyword: PBEPBE/SDD
title: #p freq=noraman PBEPBE/SDD
converged: YES YES NO NO
title: Mulliken charges:
elementType: O O N N C C C C C C C C C C C C C C C C C C C C H H H H H H H H H H H H H H H H H H
charge: -0.214763 -0.189788 -0.118978 0.099847 0.116587 0.281140 0.406474 0.341689 -0.378549 -0.375782 -0.361156 -0.320469 -0.370354 -0.346432 -0.652139 -0.252058 -0.250168 -0.280621 -0.256836 -0.256492 -0.271012 -0.244781 -0.247328 -0.240249 0.266363 0.245363 0.250564 0.245394 0.243669 0.287426 0.265134 0.259120 0.252177 0.229243 0.225372 0.230331 0.230411 0.225559 0.232058 0.232945 0.228691 0.232401
chargesum: 0.00000
title: Mulliken charges with hydrogens summed into heavy atoms:
elementType: O O N N C C C C C C C C C C C C C C C C C C C C
charge: -0.214763 -0.189788 -0.118978 0.099847 0.116587 0.281140 0.406474 0.341689 -0.112185 -0.130420 -0.110592 -0.075076 -0.126686 -0.059006 0.124292 -0.022815 -0.024796 -0.050290 -0.026426 -0.030933 -0.038954 -0.011836 -0.018637 -0.007848
polarizability: 2.36819369e+02 -4.73685366e+00 2.39822188e+02 -1.75526534e+01 -1.09960721e+00 2.12600275e+02
1716.lowfreq: -10.1548 -0.9038 0.0002 0.0004 0.0008 7.7032 34.9705 58.4277 60.5873
frequency: 34.9391 58.4146 60.5825 66.7539 86.7187 92.2264 104.0759 119.4192 124.1585 162.9260 210.5506 224.0108 232.8196 248.2897 269.1998 275.5112 284.2545 313.2467 338.2941 350.7517 389.2689 403.5333 413.3882 420.5178 480.9869 505.4570 540.4516 560.9792 615.3740 616.3044 618.8541 624.7055 640.9300 655.4326 672.8188 696.3173 701.1977 713.2109 718.4210 752.3783 762.3832 778.0667 844.8954 852.2361 863.1374 865.6075 893.8280 896.2493 927.8990 933.0645 945.5544 947.3300 980.2343 988.9685 990.4559 991.3860 992.3901 993.8886 995.7816 1000.4486 1002.1054 1029.2089 1030.2045 1032.5638 1082.3782 1091.5376 1093.6029 1111.5774 1118.6626 1146.4191 1166.7033 1173.6927 1175.0596 1175.4692 1183.3821 1194.6196 1197.8467 1200.0300 1202.7371 1211.4225 1313.1355 1326.2187 1331.0265 1369.7316 1377.3331 1381.3293 1398.1791 1429.9684 1438.2687 1439.5342 1440.1756 1459.3725 1476.4774 1479.4993 1482.6116 1483.3323 1583.6010 1589.5879 1593.0644 1606.6959 1608.3969 1611.1592 3001.4174 3092.2858 3123.6286 3125.0534 3125.8172 3130.3258 3132.8821 3135.0639 3143.0305 3145.4682 3147.0248 3148.8864 3150.8056 3156.0860 3161.5872 3165.2614 3168.0151 3182.5754
redmass: 4.0157 5.5406 5.4369 5.9227 4.9220 4.3914 4.6049 3.8900 4.2638 3.6759 1.8584 4.2173 3.4507 3.3890 5.3520 5.1057 4.6109 4.7235 5.4405 5.1653 3.6277 2.8366 2.9340 2.9294 3.5201 4.1690 3.5629 6.9672 6.4214 6.3725 6.3440 5.7387 6.2056 6.1714 12.1078 5.3709 1.9789 1.6304 1.7833 1.6929 2.2826 2.0170 4.2213 1.2640 1.2481 1.2733 3.8638 3.8423 2.5629 1.7474 1.6459 1.5932 1.3962 1.4695 4.7457 1.5977 4.1357 3.9262 1.3954 1.3231 1.3079 2.3782 2.3276 2.1773 1.6534 1.6182 1.6308 1.5705 2.9592 3.4582 3.6586 1.0840 1.1151 1.0707 2.9998 1.1338 1.1943 2.4713 1.1515 4.0618 1.4326 1.3354 1.3338 5.4653 8.0609 8.1243 8.7070 2.1690 2.0158 2.1318 1.3103 1.0529 2.1189 1.1679 1.8870 2.0634 5.7406 6.1717 6.2181 6.0051 5.9552 5.9871 1.0378 1.0984 1.0843 1.0848 1.0849 1.0873 1.0878 1.0884 1.0918 1.0932 1.0946 1.0986 1.0959 1.0950 1.0990 1.1014 1.1008 1.0955
irintensity: 1.2494 0.3214 0.5108 0.8267 0.0826 0.4116 0.2965 2.8990 1.2598 0.4936 1.3033 1.1483 3.5601 0.5643 0.4289 0.3623 0.4514 0.1145 1.5289 10.3944 2.8049 0.1639 0.1968 0.0610 2.7754 8.5568 0.7419 10.1501 0.0758 0.9996 0.4508 29.3455 9.7836 7.6346 12.3921 1.2069 25.0482 135.8335 12.6675 54.0574 30.5611 19.1972 16.0838 0.4117 0.8204 0.5509 28.1191 10.5195 64.0423 10.4697 8.5556 11.8575 0.5882 0.4975 0.7895 1.6661 2.2047 0.2704 0.1294 0.2330 0.2162 3.4619 7.3642 11.3020 4.5054 9.9141 8.2573 38.1531 11.1071 54.5092 155.8223 0.2671 11.0390 0.2961 1.4290 1.8701 3.4177 10.1251 1.3557 26.8081 0.5161 3.3676 0.2620 5.7497 0.7532 4.0064 189.6362 5.2473 25.0985 4.0248 11.4757 13.4333 25.0962 10.8164 14.8347 26.8912 0.1532 0.9825 0.7703 8.0435 5.2759 1.5266 18.8774 13.5761 2.7251 1.6259 2.4703 1.1401 2.4388 6.1069 27.7198 19.2797 30.3845 4.5160 30.6139 22.5324 27.2907 20.5157 16.9572 2.5701
temp: 298.150 k
press: 1.00000 atm
elementType: 8 8 7 7 6 6 6 6 6 6 6 6 6 6 6 6 6 6 6 6 6 6 6 6 1 1 1 1 1 1 1 1 1 1 1 1 1 1 1 1 1 1
symmnumber: 1
zpe: 867978.1 jmol-1
zpe.correction: 0.330595 hartree
zpe.thermalcorrener: 0.350729 hartree
zpe.thermalcorrenthalpy: 0.351673 hartree
zpe.thermalcorrgfe: 0.282217 hartree
zpe.sumelectzpe: -1031.074676 hartree
zpe.sumelectthermal: -1031.054543 hartree
zpe.sumelectthermalent: -1031.053599 hartree
zpe.sumelectthermalfe: -1031.123054 hartree
dipole: -2.2015 -4.0216 -1.9290
dipole: 4.9740
quadrupole: -133.0084 -135.4659 -137.2497
quadrupole: -7.8308 -11.5058 -7.5358
quadrupole: 2.2329 -0.2246 -2.0084 -7.8308 -11.5058 -7.5358
hfenergy: -1031.4052714 hartree
pointgroup: C01 [X(C20H18N2O2)]
dipole: -1.6254602 0.5806439 0.9221004 debye
polarizability: 235.9924113|0.0805475|243.3334431|11.2735012|10.9078051|209.9159778 unknown
InChI: InChI=1S/C20H18N2O2/c1-21(22(23)24)20(17-11-5-2-6-12-17,18-13-7-3-8-14-18)19-15-9-4-10-16-19/h2-16H,1H3
charge 0 multiplicity 1
42 atoms
O  1.87146 0.233524 -3.452029
O  2.442163 -0.631544 -1.408956
N  0.286226 0.20132 -1.769718
N  1.610836 -0.07911 -2.222683
C  0.017078 0.130135 -0.266387
C  -1.523035 0.250757 -0.047042
C  0.319595 -1.288121 0.297046
C  0.833362 1.282826 0.377338
C  -2.050842 0.923251 1.08201
C  0.329227 -2.435663 -0.531336
C  0.3826 2.624594 0.240005
C  -2.417799 -0.466411 -0.885071
C  0.418904 -1.46237 1.699319
C  2.101751 1.057487 0.970592
C  -0.418016 1.158547 -2.656467
C  -3.439021 0.907292 1.347709
C  0.469207 -3.724001 0.025282
C  1.161251 3.704447 0.705199
C  -3.802924 -0.476609 -0.626014
C  0.559919 -2.750721 2.258495
C  2.880052 2.138278 1.440427
C  -4.323989 0.21472 0.4930
C  0.589398 -3.890351 1.424072
C  2.415096 3.46582 1.313977
H  -1.382033 1.456566 1.764093
H  0.238919 -2.327638 -1.61723
H  -0.586803 2.832283 -0.226556
H  -2.025881 -1.029479 -1.739425
H  0.374538 -0.593158 2.364426
H  2.488665 0.039281 1.052176
H  -0.605312 0.693353 -3.636819
H  0.187655 2.068788 -2.815539
H  -1.375107 1.419926 -2.187874
H  -3.824872 1.434427 2.227395
H  0.489935 -4.598289 -0.634899
H  0.789723 4.729013 0.592244
H  -4.473566 -1.032946 -1.290172
H  0.63982 -2.861937 3.345717
H  3.857835 1.9397 1.892837
H  -5.399755 0.204013 0.699531
H  0.70008 -4.891399 1.85534
H  3.022462 4.302803 1.675987
