program: Gaussian 09
title: 000181002
version: EM64L-G09RevD.01
frameworkgroup: C1[X(C25H21F3O4)]
method: RPBEPBE
basis: SDD
operation: Freq
keyword: #p
keyword: freq=noraman
keyword: PBEPBE/SDD
title: #p freq=noraman PBEPBE/SDD
converged: YES YES NO NO
title: Mulliken charges:
elementType: F F F O O O O C C C C C C C C C C C C C C C C C C C C C C C C C H H H H H H H H H H H H H H H H H H H H H
charge: -0.171006 -0.165018 -0.205987 -0.269160 -0.221914 -0.264062 -0.310219 -0.110551 0.303432 -0.607828 0.473255 0.246117 -0.406805 -0.387323 -0.370228 -0.348912 0.326825 -0.371388 0.443303 -0.528893 -0.423161 -0.243755 0.342673 -0.193288 -0.397607 -0.688001 0.349928 -0.306657 -0.358920 -0.356787 -0.345720 0.295032 0.292473 0.274084 0.243797 0.238147 0.252111 0.259675 0.251884 0.247266 0.308276 0.238267 0.215749 0.219192 0.233773 0.262468 0.230619 0.233315 0.207329 0.274884 0.266205 0.263526 0.259584
chargesum: 0.00000
title: Mulliken charges with hydrogens summed into heavy atoms:
elementType: F F F O O O O C C C C C C C C C C C C C C C C C C C C C C C C C
charge: -0.171006 -0.165018 -0.205987 -0.269160 -0.221914 -0.264062 -0.310219 -0.110551 0.303432 -0.041271 0.473255 0.246117 -0.163009 -0.149176 -0.118117 -0.089237 0.326825 0.127762 0.443303 -0.220617 -0.184894 0.191186 0.342673 0.040485 -0.135139 -0.016738 0.349928 -0.031773 -0.092715 -0.093261 -0.086137 0.295032
polarizability: 3.57175483e+02 -2.73451070e+01 2.80044686e+02 1.09814631e+00 -7.96434423e+00 2.03981349e+02
1716.lowfreq: -8.5466 -5.0584 -3.5387 -0.0008 0.0000 0.0003 3.6568 8.6128 22.2122
frequency: -5.8370 8.3470 22.1887 28.6521 34.6043 38.5715 44.0691 49.4259 60.8474 69.8146 81.4410 93.0770 112.3945 116.5948 137.3670 154.8346 165.8198 183.4537 208.1949 211.4134 220.3836 236.7645 239.5196 241.4332 271.6846 305.2451 325.7831 339.9783 347.4686 383.6721 385.0207 406.2795 411.5906 416.0207 417.5852 426.5114 437.7628 445.6889 488.6519 500.8876 504.6920 524.9219 540.0230 561.4131 562.7546 603.3820 621.6292 627.6103 634.9646 659.3566 676.9692 690.5017 705.6303 725.5940 737.5932 765.7833 781.1988 794.0653 805.2865 805.7290 810.6439 828.0778 830.2701 832.5149 839.0721 865.0636 887.8455 888.6042 901.5104 913.4995 918.2144 934.1819 944.9732 950.1729 952.2599 964.0752 965.5674 978.2062 987.3583 996.3010 998.1106 999.8660 1032.7838 1037.5960 1059.2290 1085.1333 1091.2219 1099.8215 1114.3872 1120.6828 1134.7917 1136.2289 1150.8403 1155.2826 1173.5942 1174.9631 1178.2657 1188.7850 1205.0988 1215.8598 1227.0891 1247.9772 1264.4013 1279.1619 1282.8216 1292.7726 1304.5484 1353.9678 1356.5435 1363.1537 1372.8075 1374.2447 1389.9423 1400.0592 1410.6070 1420.3039 1433.7010 1438.6904 1460.6445 1463.2099 1475.7799 1477.7079 1483.3405 1486.7878 1505.1071 1578.5591 1594.8845 1598.7496 1613.5205 1615.0715 1621.8998 1626.5367 2960.0674 2992.4565 2996.7281 3020.0599 3054.5450 3093.7973 3105.4542 3112.5068 3128.2229 3130.6327 3145.5660 3152.5328 3161.3921 3162.1182 3167.3194 3169.0461 3173.8596 3176.0497 3178.9736 3182.5765 3225.4293
redmass: 6.6157 6.9295 4.9951 4.9458 4.6372 7.1589 5.8309 4.9887 4.7743 5.2399 6.9483 5.6133 2.0003 5.6140 5.7583 6.6838 6.0385 6.5499 2.9386 5.0912 7.1835 2.7003 3.4045 2.0635 7.2327 7.2863 5.3584 5.2555 8.0008 5.1020 4.8478 4.5142 3.1428 3.4628 4.2639 3.7228 3.2323 5.2124 3.7415 4.5841 4.2816 4.9108 3.1865 5.7921 5.0378 5.5653 5.9597 7.0771 6.8153 7.8477 5.3532 2.8969 3.2084 4.5347 4.5089 4.7158 4.3756 1.5966 2.8007 1.6423 1.2679 2.2625 2.4264 1.1804 1.6765 2.9075 1.8950 1.3547 3.3907 1.4848 5.2077 1.3245 1.3860 1.3433 3.9707 3.0015 1.5775 1.3393 5.9525 1.8179 2.7369 3.1971 2.7482 2.7797 3.8154 1.5940 1.4404 1.2573 1.9848 1.4244 1.4482 1.9097 1.3325 3.3059 1.9024 1.2591 1.5181 2.7364 1.1754 3.4353 2.9424 3.3015 1.1376 2.7196 1.4219 1.4161 1.3110 1.7954 2.7778 2.7630 6.1254 1.7993 6.3168 1.2840 3.7584 3.7787 2.7472 1.4805 1.0400 1.0985 1.0857 2.5478 2.6187 1.1323 2.3194 7.3514 7.0551 7.2598 6.6605 7.1003 6.7097 9.6165 1.0555 1.0590 1.0362 1.1075 1.1036 1.0988 1.1014 1.0558 1.0883 1.0894 1.0895 1.0925 1.0885 1.0889 1.0951 1.0922 1.0945 1.0978 1.0971 1.0978 1.1168
irintensity: 0.2519 0.0732 0.6859 0.2689 0.9919 0.7068 0.2767 0.1739 0.4746 0.6954 1.2261 2.0318 2.0198 0.6335 0.6601 2.2118 2.8200 2.4498 8.4445 0.7459 2.6632 0.2157 1.3357 0.4028 0.3845 4.6397 2.6716 2.1045 5.9640 1.5421 0.8033 7.4831 1.7128 2.5746 3.8290 1.7255 8.3000 1.2869 25.5637 3.1892 9.9837 4.9471 23.3533 11.7583 4.4111 5.4013 12.5617 4.0662 0.7330 5.6549 17.8187 9.3463 3.6588 4.4887 3.8534 20.9509 37.4276 46.9844 22.0878 2.5826 11.3189 62.1205 50.5580 2.9772 24.0740 29.3372 47.1573 2.1316 25.1216 4.2610 27.1358 0.4387 0.9471 3.2098 89.7380 100.8560 23.8889 0.3270 1.0368 1.3997 10.0034 17.2056 29.1488 60.0807 80.6816 1.6940 21.6946 12.5727 2.0288 10.5720 2.4000 18.9232 25.2803 81.8212 142.4579 18.1021 203.1992 333.9049 6.6041 54.9383 198.3240 160.0237 0.0752 62.3298 14.2172 20.1515 1.2278 16.5030 51.1963 21.6091 3.6442 13.5424 2.9453 39.4233 1.0251 2.6383 49.1589 72.1615 10.1749 33.3884 33.6755 199.8200 115.2680 39.1774 90.7852 11.6556 80.3964 36.5302 61.3146 1.1702 19.9915 168.2880 32.8957 11.1960 25.6087 26.8492 10.0257 26.5872 32.0976 2.0782 5.8467 9.1722 12.2086 19.3399 6.6163 0.7598 6.6624 1.6411 4.0147 9.4676 1.2339 0.6357 0.7175
temp: 298.150 k
press: 1.00000 atm
elementType: 9 9 9 8 8 8 8 6 6 6 6 6 6 6 6 6 6 6 6 6 6 6 6 6 6 6 6 6 6 6 6 6 1 1 1 1 1 1 1 1 1 1 1 1 1 1 1 1 1 1 1 1 1
symmnumber: 1
zpe: 1042204.7 jmol-1
zpe.correction: 0.396955 hartree
zpe.thermalcorrener: 0.425631 hartree
zpe.thermalcorrenthalpy: 0.426575 hartree
zpe.thermalcorrgfe: 0.334020 hartree
zpe.sumelectzpe: -1563.345506 hartree
zpe.sumelectthermal: -1563.316830 hartree
zpe.sumelectthermalent: -1563.315886 hartree
zpe.sumelectthermalfe: -1563.408440 hartree
dipole: 1.2521 1.9219 -2.1138
dipole: 3.1192
quadrupole: -180.2210 -170.2452 -193.7033
quadrupole: -4.9590 -0.9195 4.3498
quadrupole: 1.1688 11.1446 -12.3134 -4.9590 -0.9195 4.3498
hfenergy: -1563.7424606 hartree
pointgroup: C01 [X(C25H21F3O4)]
dipole: -0.4294474 -0.4620492 1.0526637 debye
polarizability: 290.6172384|-46.0626599|337.4218897|-17.1850917|-18.0030336|213.1623909 unknown
InChI: InChI=1S/C25H21F3O4/c1-2-30-20-10-6-18(7-11-20)24(16-25(24,27)28)23(29)31-15-17-4-3-5-22(14-17)32-21-12-8-19(26)9-13-21/h3-14H,2,15-16H2,1H3
charge 0 multiplicity 1
53 atoms
F  0.044155 3.715751 -3.090307
F  1.791445 2.263134 -3.333665
F  0.951527 -4.518766 -2.098896
O  -0.806894 2.466049 0.143271
O  -0.224489 4.716182 0.029081
O  3.961668 -1.486079 1.372614
O  -2.55793 -2.112564 1.547998
C  1.249012 3.002177 -0.9638
C  1.219629 3.225127 -2.477431
C  2.084634 4.135031 -1.670415
C  1.95099 1.796816 -0.392912
C  0.02897 3.515657 -0.218372
C  3.01851 1.971692 0.526276
C  1.544123 0.48421 -0.723004
C  3.665716 0.862668 1.098221
C  2.183785 -0.639864 -0.159564
C  3.251462 -0.450074 0.755354
C  -2.04056 2.855128 0.877258
C  -2.860548 1.610602 1.150021
C  -2.278018 0.322115 1.145709
C  -4.234781 1.763109 1.465051
C  3.579615 -2.876968 1.043987
C  -3.086012 -0.796728 1.449148
C  -5.0184 0.634416 1.788973
C  -4.449656 -0.657391 1.780058
C  4.502704 -3.787873 1.847716
C  -1.653862 -2.624203 0.590778
C  -1.586105 -2.170432 -0.748898
C  -0.865252 -3.713944 1.028965
C  -0.708737 -2.807195 -1.654693
C  0.007108 -4.356577 0.126429
C  0.070723 -3.883229 -1.196858
H  1.727702 5.157237 -1.51007
H  3.166462 3.990959 -1.728536
H  3.345368 2.983388 0.794115
H  0.72086 0.333488 -1.429316
H  4.490696 0.98449 1.806449
H  1.84645 -1.641203 -0.439516
H  -1.73332 3.358861 1.814117
H  -2.599216 3.590048 0.269711
H  -1.215818 0.205465 0.912811
H  -4.690382 2.760366 1.459459
H  3.696975 -3.042124 -0.046537
H  2.515629 -3.036733 1.312366
H  -6.077715 0.757894 2.037194
H  -5.035705 -1.548736 2.021219
H  4.37929 -3.613103 2.930169
H  5.558017 -3.602939 1.584401
H  4.269978 -4.846921 1.633612
H  -2.213242 -1.341683 -1.088559
H  -0.954439 -4.04812 2.066244
H  -0.639196 -2.483064 -2.697138
H  0.618675 -5.209648 0.434511
