program: Gaussian 09
title: 000180985
version: EM64L-G09RevD.01
frameworkgroup: C1[X(C25H23ClO4)]
method: RPBEPBE
basis: SDD
operation: Freq
keyword: #p
keyword: freq=noraman
keyword: PBEPBE/SDD
title: #p freq=noraman PBEPBE/SDD
converged: YES YES NO NO
title: Mulliken charges:
elementType: Cl O O O O C C C C C C C C C C C C C C C C C C C C C C C C C H H H H H H H H H H H H H H H H H H H H H H H
charge: -0.033890 -0.290438 -0.219310 -0.265726 -0.312205 0.008462 -0.446861 -0.516734 0.507630 0.251624 -0.410868 -0.374961 -0.376838 -0.372565 0.336145 -0.491874 0.559753 -0.507212 -0.471976 -0.243095 0.336876 -0.187305 -0.394155 -0.685917 0.343745 -0.356902 -0.384303 -0.208839 -0.192571 -0.262743 0.319923 0.271179 0.271979 0.235220 0.246067 0.248148 0.244067 0.256899 0.230390 0.295833 0.237782 0.206858 0.210149 0.231893 0.262057 0.231732 0.232589 0.206549 0.258710 0.257535 0.247728 0.229325 0.230440
chargesum: 0.00000
title: Mulliken charges with hydrogens summed into heavy atoms:
elementType: Cl O O O O C C C C C C C C C C C C C C C C C C C C C C C C C
charge: -0.033890 -0.290438 -0.219310 -0.265726 -0.312205 0.008462 -0.126938 0.026424 0.507630 0.251624 -0.175648 -0.128894 -0.128690 -0.128498 0.336145 -0.004585 0.559753 -0.211379 -0.234194 0.173911 0.336876 0.044588 -0.132098 -0.015047 0.343745 -0.098192 -0.126768 0.038889 0.036754 -0.032303
polarizability: 3.72959989e+02 4.76968233e+01 3.05894046e+02 1.41324010e+00 -4.58481262e+00 1.93342600e+02
1716.lowfreq: -2.3891 -0.0013 -0.0011 -0.0006 4.8227 6.1715 14.2819 16.6062 29.3402
frequency: 14.0979 16.5684 29.2958 31.3219 35.9935 42.1994 47.8761 57.8648 68.6598 77.7193 86.4029 107.0847 118.9259 140.6666 159.7390 171.9602 196.4448 206.9561 218.4455 223.1576 246.8574 251.1835 264.3224 296.4656 308.8142 334.4616 359.7209 367.0756 391.1980 404.2919 410.9001 416.7300 429.6730 459.6358 480.5970 485.7630 501.3389 520.9575 542.8428 563.1264 587.7942 600.7272 611.9863 619.4854 632.2663 641.6259 688.5925 691.9137 701.1908 712.2067 719.8715 733.6456 764.6989 771.3134 798.4283 806.0531 813.5198 815.2332 833.0467 836.1635 838.9689 849.0614 890.3047 902.7183 904.1171 912.2853 919.1746 942.4473 945.9493 949.1804 962.5425 971.2996 977.6362 978.2845 986.7064 987.5811 991.4957 1002.6521 1007.7895 1018.2902 1027.6875 1037.9698 1077.0476 1084.9799 1087.9515 1106.2203 1114.6871 1121.2154 1134.1618 1135.8550 1140.9470 1167.0887 1172.4366 1173.7517 1181.1932 1198.1618 1216.9489 1227.2197 1231.9156 1252.2039 1263.0123 1284.9170 1300.9479 1303.6948 1309.4587 1332.2995 1350.3145 1360.8997 1375.1237 1381.2326 1390.8512 1400.2443 1418.9321 1431.1936 1435.4826 1442.4176 1461.6351 1464.6321 1469.2971 1477.1696 1480.0580 1488.0198 1508.4279 1582.1826 1593.0932 1594.6383 1609.0896 1612.1894 1624.6169 1631.0713 2954.2445 2996.7851 3012.5586 3027.7701 3093.9605 3105.7692 3108.1160 3113.3489 3130.3809 3130.7544 3132.3924 3139.6364 3140.3153 3150.7628 3153.1129 3154.6402 3163.6177 3164.4532 3167.8781 3173.7637 3174.5435 3187.3318 3222.9423
redmass: 5.8412 5.3694 5.6511 4.9308 6.8661 4.9005 5.0585 5.4428 4.8420 5.9133 5.3361 6.8418 1.8308 4.7604 6.2689 5.8599 4.7580 4.6379 4.4864 5.5794 1.2512 5.1612 5.2305 4.4253 4.9957 4.0438 4.8374 4.7179 3.6985 3.4433 2.9602 2.9719 3.2692 3.7956 3.4440 5.2114 4.6604 4.6597 2.9972 7.6766 5.6282 5.0922 6.2821 4.6667 6.6831 5.5679 3.4173 2.3684 3.3675 4.0266 3.1658 4.1034 1.5805 4.3726 1.8913 1.6543 2.3845 2.5339 1.1914 1.5051 2.0657 2.9017 1.7593 1.4077 3.3107 1.9238 1.6701 1.9781 1.6974 1.9397 1.3946 1.3599 1.4482 2.6989 6.0864 5.8872 1.2997 2.0920 2.4636 2.0859 2.3205 2.8192 1.5025 1.3352 1.5416 1.2909 1.9539 1.5072 2.6640 1.4462 1.9416 1.1671 1.1179 1.1750 1.3048 2.3988 1.7532 2.7710 1.2464 3.1791 1.1409 1.9967 1.3069 1.2966 1.3047 3.3689 1.3600 2.2487 2.0385 7.9905 8.2005 1.2883 3.7977 1.2046 2.6785 2.3734 1.0398 1.1369 2.2430 1.0768 2.5211 1.1306 2.3801 7.3908 6.2915 6.5773 6.5095 6.5999 6.6354 10.2729 1.0554 1.0362 1.1075 1.0598 1.0988 1.1013 1.1054 1.0558 1.0851 1.0877 1.0887 1.0889 1.0890 1.0925 1.0929 1.0927 1.0965 1.0949 1.0958 1.0999 1.0978 1.0918 1.1159
irintensity: 0.1293 0.0638 1.1883 0.4771 1.0627 0.8101 0.9318 0.4032 0.0912 0.0774 1.2253 0.7260 2.4838 1.1082 1.7775 2.0398 2.5550 0.7251 0.4997 5.9547 1.0559 4.2136 2.3244 4.2019 0.1756 1.1405 1.7682 1.6931 2.5267 5.7658 0.5914 0.1661 3.1273 14.5325 18.0638 6.9137 1.0739 8.9580 30.4643 0.3343 0.3900 27.5066 0.3560 6.4296 0.6082 13.3280 13.3453 36.5863 14.9287 16.3571 0.9092 9.1023 111.9767 2.2993 34.9103 29.1939 11.0214 10.7926 6.2573 0.5586 1.2688 66.0918 20.5098 8.7878 37.4393 31.3274 5.1376 3.5522 6.1888 41.4565 9.6879 0.5400 6.7784 68.0361 1.0905 1.0133 0.1047 9.7494 5.6562 8.0211 239.5394 39.2770 13.3061 4.7970 3.5831 8.0743 12.3506 14.8055 113.7410 6.8298 1.1559 35.7659 19.2352 12.5435 108.2175 157.2782 62.9446 231.3001 16.3649 182.0271 0.0243 47.0025 2.4152 3.4978 0.9412 18.5861 26.2155 1.9669 10.9299 7.4557 5.3000 36.0259 3.5914 16.6593 43.6047 14.6700 11.5672 37.9406 132.6729 27.4575 21.4301 35.6435 97.4843 10.7963 58.9413 90.6716 21.4085 1.4754 116.6625 139.2621 34.7060 28.5374 33.8166 30.6342 27.6760 33.6985 9.2491 2.3741 1.5316 6.1407 11.2928 9.4095 7.8361 25.1539 0.3276 23.9632 14.6341 9.3538 4.3501 8.6849 8.6393 0.6911 1.8818
temp: 298.150 k
press: 1.00000 atm
elementType: 17 8 8 8 8 6 6 6 6 6 6 6 6 6 6 6 6 6 6 6 6 6 6 6 6 6 6 6 6 6 1 1 1 1 1 1 1 1 1 1 1 1 1 1 1 1 1 1 1 1 1 1 1
symmnumber: 1
zpe: 1085440.3 jmol-1
zpe.correction: 0.413422 hartree
zpe.thermalcorrener: 0.441147 hartree
zpe.thermalcorrenthalpy: 0.442091 hartree
zpe.thermalcorrgfe: 0.351147 hartree
zpe.sumelectzpe: -1725.229777 hartree
zpe.sumelectthermal: -1725.202052 hartree
zpe.sumelectthermalent: -1725.201108 hartree
zpe.sumelectthermalfe: -1725.292053 hartree
dipole: -0.4478 -0.3218 -0.0276
dipole: 0.5521
quadrupole: -163.4863 -159.7916 -192.3428
quadrupole: 20.7874 -0.0538 -2.4183
quadrupole: 8.3873 12.0819 -20.4692 20.7874 -0.0538 -2.4183
hfenergy: -1725.6431995 hartree
pointgroup: C01 [X(C25H23Cl1O4)]
dipole: 0.1522098 0.1547877 -0.007262 debye
polarizability: 354.5477508|56.09844|324.367117|5.4716776|2.9805257|193.2817675 unknown
InChI: InChI=1S/C25H23ClO4/c1-2-28-20-13-11-19(12-14-20)25(16-23(25)26)24(27)29-17-18-7-6-10-22(15-18)30-21-8-4-3-5-9-21/h3-15,23H,2,16-17H2,1H3
charge 0 multiplicity 1
53 atoms
Cl -1.096174 0.929892 3.027786
O  1.085079 2.775858 -0.56279
O  0.01929 1.170903 -1.888493
O  -5.725162 -1.1645 -0.935159
O  4.22198 -1.579632 0.086213
C  -0.996036 1.881898 0.239536
C  -0.370287 1.939041 1.668876
C  -1.104382 3.143461 1.145491
C  -2.228814 1.063872 -0.042876
C  0.038824 1.881776 -0.859159
C  -3.481586 1.683559 -0.280034
C  -2.147113 -0.346123 -0.118948
C  -4.625029 0.919047 -0.57302
C  -3.282709 -1.129606 -0.411194
C  -4.529984 -0.493267 -0.638073
C  2.266116 2.758725 -1.494008
C  3.397441 1.958292 -0.8849
C  3.239509 0.563208 -0.688593
C  4.608781 2.58852 -0.509344
C  -5.684852 -2.637615 -1.026067
C  4.284203 -0.177296 -0.095364
C  5.659818 1.825361 0.050982
C  5.502714 0.440954 0.26771
C  -7.103255 -3.097847 -1.3512
C  2.995811 -2.217979 0.418227
C  2.047463 -1.640786 1.294823
C  2.816889 -3.520346 -0.095528
C  0.896011 -2.381134 1.644841
C  1.664946 -4.251849 0.268135
C  0.699361 -3.686055 1.134291
H  0.717476 1.959746 1.74835
H  -2.099282 3.33956 1.55426
H  -0.508425 4.021654 0.886882
H  -3.56321 2.775982 -0.243813
H  -1.185622 -0.844478 0.046535
H  -5.595317 1.389118 -0.75916
H  -3.183457 -2.217605 -0.462783
H  1.923908 2.332845 -2.454053
H  2.53377 3.819627 -1.616018
H  2.3180 0.06449 -1.006898
H  4.730596 3.668026 -0.654583
H  -5.336751 -3.05746 -0.059663
H  -4.970791 -2.938192 -1.820274
H  6.599894 2.311893 0.331969
H  6.296711 -0.167414 0.710408
H  -7.805136 -2.783901 -0.559892
H  -7.442998 -2.665231 -2.307585
H  -7.136137 -4.199574 -1.43287
H  2.209884 -0.640404 1.708385
H  3.57648 -3.937473 -0.763342
H  0.16257 -1.934581 2.325541
H  1.522419 -5.263284 -0.127985
H  -0.192239 -4.257179 1.41423
