program: Gaussian 09
title: 000180990
version: EM64L-G09RevD.01
frameworkgroup: C1[X(C25H22BrClO4)]
method: RPBEPBE
basis: SDD
operation: Freq
keyword: #p
keyword: freq=noraman
keyword: PBEPBE/SDD
title: #p freq=noraman PBEPBE/SDD
converged: YES YES NO NO
title: Mulliken charges:
elementType: Br Cl O O O O C C C C C C C C C C C C C C C C C C C C C C C C C H H H H H H H H H H H H H H H H H H H H H H
charge: 0.087873 0.041299 -0.252505 -0.218356 -0.264312 -0.310022 0.065849 -0.483045 -0.504916 0.486083 0.248138 -0.363014 -0.411488 -0.369911 -0.372620 0.336513 -0.461287 0.495403 -0.472870 -0.451122 -0.244197 0.343261 -0.185494 -0.394366 -0.684904 0.333637 -0.346083 -0.386507 -0.212954 -0.195859 -0.262371 0.308737 0.289905 0.247322 0.241698 0.248951 0.250949 0.241017 0.243906 0.280499 0.240447 0.209808 0.209346 0.231398 0.260750 0.207996 0.232339 0.232675 0.274006 0.256997 0.241970 0.228843 0.230591
chargesum: 0.00000
title: Mulliken charges with hydrogens summed into heavy atoms:
elementType: Br Cl O O O O C C C C C C C C C C C C C C C C C C C C C C C C C
charge: 0.087873 0.041299 -0.252505 -0.218356 -0.264312 -0.310022 0.065849 -0.483045 0.093725 0.486083 0.248138 -0.115692 -0.169790 -0.120960 -0.121671 0.336513 0.023635 0.495403 -0.192371 -0.210675 0.174958 0.343261 0.045904 -0.133616 -0.011894 0.333637 -0.072076 -0.129510 0.029015 0.032983 -0.031781
polarizability: 3.66065247e+02 3.58963863e+01 3.19437502e+02 1.71796385e+01 3.03499574e+01 2.36122410e+02
1716.lowfreq: -4.8428 -0.8315 -0.0014 -0.0003 0.0011 5.8413 7.2964 11.9637 25.1213
frequency: 7.1005 11.9271 25.0316 29.3571 32.8395 33.8208 43.9598 47.6312 54.2279 61.5605 73.1360 90.5432 110.1427 117.2866 139.5804 156.5965 165.8148 185.3702 192.4536 204.7607 218.7029 240.3238 242.7309 249.4369 275.4965 301.6954 313.2711 321.1163 356.5285 372.2375 388.9751 400.5159 409.4445 412.6837 416.4204 419.5991 439.7161 479.9878 482.3999 518.1628 537.7537 543.7629 562.5139 590.4106 608.0528 612.1788 629.0725 637.4514 656.4951 686.4119 693.2101 696.3257 714.9426 732.3363 740.3300 764.0696 777.1484 796.0084 810.0380 813.7509 822.9946 832.6713 837.5612 841.5038 858.3109 884.0355 892.4582 902.6675 903.2856 913.4136 945.5629 946.9222 963.8486 972.6891 977.7837 984.5559 986.5382 988.1570 991.6318 999.3967 1009.3243 1019.1684 1033.6763 1037.5125 1068.8873 1078.1908 1084.4311 1095.7445 1114.9432 1121.9806 1134.7879 1137.9559 1146.6492 1166.5163 1173.1217 1174.7881 1181.4326 1196.2589 1224.7585 1227.2151 1245.8623 1252.0962 1260.8665 1296.8824 1302.6545 1310.5005 1314.4652 1342.8345 1359.0021 1372.4109 1381.1886 1392.1227 1398.8835 1418.5769 1430.5275 1433.3909 1441.9073 1457.8220 1460.4126 1471.0208 1476.4318 1479.9416 1487.0565 1504.2817 1578.6683 1593.2381 1594.9785 1610.8020 1612.2908 1620.7364 1623.7353 2955.9653 2997.4204 3014.7258 3032.7317 3095.0049 3102.8808 3104.0832 3106.4798 3129.7678 3131.1928 3135.9620 3139.1251 3145.6573 3153.4642 3154.2760 3157.3440 3162.6751 3166.1920 3169.6407 3172.7672 3173.6291 3214.5783
redmass: 6.3279 5.5606 5.9197 8.1985 6.6886 5.4567 3.9792 4.5927 9.3753 4.8920 4.5139 6.8221 10.1335 1.8788 4.9626 7.6931 7.1320 6.6087 5.8581 10.9297 4.5759 3.1842 1.4778 6.6508 4.8991 5.3301 4.6743 3.6867 3.8573 4.1459 4.7434 4.8012 3.6227 3.1492 3.0250 4.8984 3.5079 4.6113 3.5734 4.3919 4.2425 3.4617 7.7139 5.7528 5.6404 6.4916 6.7539 5.6930 4.2726 2.7376 2.4565 4.5516 3.2681 4.3870 4.9417 1.5643 4.1969 1.6957 1.2461 5.4967 2.1212 1.2279 1.6478 1.3161 6.1682 2.1776 2.1193 2.5103 1.6840 1.4158 3.1387 1.4058 1.3614 1.3588 1.3675 5.0482 5.9036 5.6835 1.3190 2.5608 2.3233 2.0971 2.2810 2.3778 1.6824 1.5153 1.5802 1.3195 2.0433 1.4237 1.4372 1.9213 4.3325 1.1515 1.1278 1.2191 1.2935 2.2562 1.3115 2.7325 4.8872 2.8370 1.1438 1.2984 1.3982 1.3242 3.4644 1.4110 2.2603 2.0087 7.9194 7.9426 1.2780 3.8277 1.1981 2.3698 2.2866 1.1733 1.0402 2.2643 1.0863 2.5913 1.1467 2.2100 7.3182 6.2520 6.5898 6.4661 6.7104 7.2472 8.6280 1.0554 1.0362 1.1075 1.0572 1.0989 1.1078 1.0559 1.1014 1.0851 1.0891 1.0870 1.0893 1.0884 1.0931 1.0932 1.0922 1.0966 1.0951 1.0962 1.1000 1.0982 1.1160
irintensity: 0.0649 0.0899 0.1520 0.3170 0.2686 1.5388 1.2110 0.2924 0.5143 0.2324 0.0959 0.6068 0.7320 2.4765 0.3784 0.1862 1.6240 0.9905 0.5851 0.2687 1.4622 4.8333 1.5310 0.4207 1.8632 0.4727 2.7066 5.8731 13.0366 5.0757 5.0513 7.9480 1.9238 0.1502 0.7276 2.0057 13.5208 7.9142 13.0006 5.5677 26.0536 7.3575 0.4498 3.5847 44.3042 0.7665 0.0905 8.6465 35.6264 18.5021 32.9504 5.9540 8.1332 7.2322 11.7543 101.5704 9.4970 49.5629 11.1126 22.4524 5.4706 6.9271 21.2665 2.8793 44.5051 44.6718 14.9087 22.3133 23.0595 7.5838 30.9233 1.4467 0.3380 0.2276 0.4445 3.9340 0.7117 1.7511 0.3844 12.0271 1.3502 12.1343 71.6645 56.3153 31.1602 14.1719 6.2400 26.7054 5.3123 6.2439 3.2785 16.9966 261.6438 31.9356 20.9892 29.7639 124.6135 138.8054 59.3536 226.4280 114.1784 148.6516 0.0658 10.5912 5.7471 1.5282 17.4681 25.9349 3.3927 10.2167 7.0187 7.5792 34.7490 3.6200 27.4715 38.8635 4.9887 52.7409 11.6971 135.6020 34.6112 14.7692 42.9743 94.5356 15.1439 45.7551 113.8591 29.0015 2.4135 20.7231 184.3171 33.1078 27.5765 32.2330 26.5580 26.5266 2.8205 2.1355 32.8926 0.7942 9.3201 5.4332 11.9348 13.3584 35.5397 1.5962 1.1775 7.2206 11.1542 3.0953 12.3587 8.6865 1.3699
temp: 298.150 k
press: 1.00000 atm
elementType: 35 17 8 8 8 8 6 6 6 6 6 6 6 6 6 6 6 6 6 6 6 6 6 6 6 6 6 6 6 6 6 1 1 1 1 1 1 1 1 1 1 1 1 1 1 1 1 1 1 1 1 1 1
symmnumber: 1
zpe: 1056657.5 jmol-1
zpe.correction: 0.402460 hartree
zpe.thermalcorrener: 0.431925 hartree
zpe.thermalcorrenthalpy: 0.432869 hartree
zpe.thermalcorrgfe: 0.335993 hartree
zpe.sumelectzpe: -1738.009004 hartree
zpe.sumelectthermal: -1737.979538 hartree
zpe.sumelectthermalent: -1737.978594 hartree
zpe.sumelectthermalfe: -1738.075470 hartree
dipole: 2.3226 1.9982 -1.5793
dipole: 3.4470
quadrupole: -184.9672 -183.7523 -196.2436
quadrupole: 10.7013 5.1788 1.5411
quadrupole: 3.3538 4.5688 -7.9226 10.7013 5.1788 1.5411
hfenergy: -1738.4114634 hartree
pointgroup: C01 [X(C25H22Br1Cl1O4)]
dipole: 0.700783 -0.8173652 0.8245765 debye
polarizability: 355.4097014|-44.2713197|336.6650235|8.2012319|14.1470934|229.5504342 unknown
InChI: InChI=1S/C25H22BrClO4/c1-2-29-20-13-11-19(12-14-20)24(17-25(24,26)27)23(28)30-16-18-7-6-10-22(15-18)31-21-8-4-3-5-9-21/h3-15H,2,16-17H2,1H3
charge 0 multiplicity 1
53 atoms
Br -1.336078 2.360315 -2.526287
Cl 1.43862 0.99556 -3.174561
O  -0.320936 1.476756 1.282675
O  -0.609188 3.675871 0.560344
O  5.287396 -1.106111 1.427889
O  -4.064902 -1.9007 -0.163438
C  1.039869 2.217047 -0.550497
C  0.578082 2.173458 -2.035907
C  1.351666 3.369863 -1.548131
C  2.140746 1.30645 -0.067263
C  -0.043883 2.563183 0.464889
C  1.957137 -0.093644 0.00751
C  3.375309 1.856835 0.362851
C  2.977408 -0.936748 0.493744
C  4.401218 1.031174 0.856493
C  4.20622 -0.371294 0.923393
C  -1.460263 1.632158 2.251589
C  -2.746635 1.130033 1.627884
C  -2.768078 -0.148515 1.020398
C  -3.922336 1.916767 1.657571
C  5.143411 -2.573894 1.520122
C  -3.95879 -0.617984 0.427904
C  -5.119317 1.415077 1.093918
C  -5.145056 0.149407 0.471795
C  6.448339 -3.10869 2.103204
C  -2.954639 -2.479217 -0.83805
C  -2.06202 -1.718242 -1.629358
C  -2.843633 -3.884031 -0.75692
C  -1.032263 -2.383617 -2.331692
C  -1.814161 -4.536129 -1.471527
C  -0.901795 -3.790778 -2.255527
H  0.791115 4.297363 -1.394806
H  2.381297 3.477243 -1.900472
H  1.008389 -0.533331 -0.31691
H  3.533051 2.940672 0.316304
H  2.805882 -2.016215 0.532037
H  5.355779 1.445485 1.194354
H  -1.137017 1.012611 3.104434
H  -1.536296 2.690637 2.55189
H  -1.858635 -0.756857 0.996446
H  -3.900472 2.916475 2.104893
H  4.952497 -2.988645 0.508999
H  4.279799 -2.818911 2.172055
H  -6.031264 2.020925 1.121327
H  -6.055164 -0.250542 0.015201
H  6.400374 -4.209017 2.19492
H  6.631487 -2.68139 3.103746
H  7.30087 -2.848071 1.453258
H  -2.171654 -0.631991 -1.708682
H  -3.56017 -4.439921 -0.144829
H  -0.341721 -1.795247 -2.946392
H  -1.725826 -5.626672 -1.413338
H  -0.104371 -4.300061 -2.807051
