program: Gaussian 09
title: 000180931
version: EM64L-G09RevD.01
frameworkgroup: C1[X(C14H14N4O)]
method: RPBEPBE
basis: SDD
operation: Freq
keyword: #p
keyword: freq=noraman
keyword: PBEPBE/SDD
title: #p freq=noraman PBEPBE/SDD
converged: YES YES NO NO
title: Mulliken charges:
elementType: O N N N N C C C C C C C C C C C C C C H H H H H H H H H H H H H H
charge: -0.304941 -0.135717 -0.154344 -0.622787 -0.621004 0.328942 0.447266 -0.392224 -0.355834 0.346318 -0.364802 -0.368440 -0.362735 -0.386139 -0.205004 -0.194287 -0.392900 -0.253367 0.255113 0.254999 0.262906 0.229391 0.248376 0.268079 0.256713 0.227150 0.228661 0.229956 0.228885 0.308656 0.334310 0.355224 0.303582
chargesum: 0.00000
title: Mulliken charges with hydrogens summed into heavy atoms:
elementType: O N N N N C C C C C C C C C C C C C C
charge: -0.304941 -0.135717 -0.154344 0.020179 0.037802 0.328942 0.447266 -0.137225 -0.092928 0.346318 -0.135412 -0.120065 -0.094656 -0.129426 0.022146 0.034374 -0.162944 -0.024483 0.255113
polarizability: 4.05019019e+02 1.53356237e+01 1.84070687e+02 -1.30529010e+01 2.07524268e+00 1.02069523e+02
1716.lowfreq: -1.8407 -0.0009 -0.0001 0.0007 2.7287 12.7731 25.1503 30.2219 38.0580
frequency: 25.0546 30.1811 37.5714 58.6595 66.0423 89.3237 140.3769 183.8785 197.6397 215.7719 219.5696 236.3880 306.3970 343.7485 350.0499 392.7279 407.2333 410.6881 417.3457 435.0965 454.1257 483.4379 515.5541 524.4205 571.8621 594.4372 612.4523 625.8168 635.5025 658.8019 691.8207 715.7435 722.2550 739.0585 766.3244 826.7186 830.9416 836.2234 846.6667 856.4407 905.8910 935.0103 940.2398 965.6987 966.5993 976.8544 985.9131 986.4039 1001.2518 1006.9505 1020.1742 1049.2831 1077.7951 1107.7541 1125.4204 1151.2939 1167.2882 1170.8179 1185.3349 1216.3804 1238.3317 1296.3895 1308.9441 1339.3775 1370.4363 1386.2472 1418.9224 1442.7450 1471.7018 1489.0268 1497.7034 1511.8185 1569.1996 1587.5110 1590.4821 1595.7517 1603.6270 1618.7382 1626.6498 3031.2040 3128.2331 3130.2054 3139.6675 3144.4724 3156.2842 3164.2310 3165.5205 3169.3173 3174.4879 3484.6256 3551.5586 3673.3531 3702.3900
redmass: 4.5298 4.5684 4.7046 4.2541 4.9115 5.1241 6.1809 3.1909 1.8129 5.3101 3.0971 4.1879 2.7844 5.0967 4.0815 4.4578 1.3440 2.9294 3.0756 4.3865 2.6350 3.3348 1.7410 1.6208 5.9333 4.7112 5.9315 3.4135 3.9165 4.5213 2.2939 1.8497 3.6583 2.8910 1.9792 1.4637 2.2049 1.5098 1.5804 5.7994 1.4224 4.2131 1.4283 1.4687 1.3661 1.3464 2.4643 1.9002 2.7216 2.0096 2.0913 1.8356 1.4976 1.4206 2.4800 1.9960 1.1301 1.1171 1.4439 3.1429 2.1453 1.3607 1.3467 2.1736 3.6061 8.2246 4.3520 2.3341 2.2739 2.4945 2.3235 3.7612 4.8075 1.9403 3.2082 5.7622 6.3950 6.4557 1.6354 1.0876 1.0893 1.0849 1.0891 1.0874 1.0930 1.0962 1.0960 1.0958 1.1003 1.0482 1.0450 1.0993 1.1041
irintensity: 1.8986 1.3121 0.7426 0.5724 0.9717 2.6239 15.8219 21.7836 81.1734 6.5690 28.6809 19.2002 31.8896 5.0623 12.6114 24.8129 286.5852 1.9767 0.9357 25.2429 16.3982 22.7704 149.1771 24.6527 6.6592 3.1104 1.1412 12.7533 13.5973 10.9488 32.3787 117.1213 25.8194 27.3822 66.4407 1.5797 13.4049 5.1723 40.3541 84.5140 6.5386 72.5175 22.3152 15.1323 0.6992 0.8896 0.4078 1.4146 6.2286 2.6217 15.9150 4.5278 10.9002 30.6336 94.5813 12.1730 47.5491 35.6382 0.6215 538.0989 147.7233 16.3563 1.2245 35.0750 2.6808 5.4595 4.7016 2.0075 276.7733 162.6424 26.1658 674.4665 37.8180 244.9399 136.9200 56.8465 159.3554 5.9348 695.6275 35.8024 18.1666 2.4034 11.3178 11.0930 32.8223 7.6571 15.4939 6.1345 10.5541 29.0208 110.5770 72.1812 33.8988
temp: 298.150 k
press: 1.00000 atm
elementType: 8 7 7 7 7 6 6 6 6 6 6 6 6 6 6 6 6 6 6 1 1 1 1 1 1 1 1 1 1 1 1 1 1
symmnumber: 1
zpe: 674657.1 jmol-1
zpe.correction: 0.256963 hartree
zpe.thermalcorrener: 0.274259 hartree
zpe.thermalcorrenthalpy: 0.275203 hartree
zpe.thermalcorrgfe: 0.209816 hartree
zpe.sumelectzpe: -834.745564 hartree
zpe.sumelectthermal: -834.728269 hartree
zpe.sumelectthermalent: -834.727325 hartree
zpe.sumelectthermalfe: -834.792712 hartree
dipole: -3.1081 -3.7437 -0.1432
dipole: 4.8678
quadrupole: -68.4452 -96.6505 -113.2678
quadrupole: 11.7266 -0.8705 2.6633
quadrupole: 24.3426 -3.8627 -20.4799 11.7266 -0.8705 2.6633
hfenergy: -835.0025277 hartree
pointgroup: C01 [X(C14H14N4O1)]
dipole: 1.2248308 -1.4720844 0.0233074 debye
polarizability: 405.2144636|-14.6505897|184.0796688|-11.6290718|0.0697214|101.8650975 unknown
InChI: InChI=1S/C14H14N4O/c15-14(16)18-17-10-11-6-8-13(9-7-11)19-12-4-2-1-3-5-12/h1-10H,15-16H2
charge 0 multiplicity 1
33 atoms
O  -2.720511 1.19893 0.336911
N  3.714144 -0.023556 0.031323
N  5.101625 0.198644 -0.144653
N  7.178427 -0.848798 0.038721
N  5.216061 -2.151756 0.360418
C  -1.320489 1.065925 0.157891
C  1.51037 1.021437 -0.067649
C  -0.633317 2.233186 -0.239705
C  -0.610631 -0.124576 0.458248
C  -3.601672 0.115466 0.094248
C  0.770063 2.205567 -0.348832
C  0.790031 -0.139463 0.342194
C  -3.394594 -0.83196 -0.936443
C  -4.772171 0.087645 0.884576
C  -4.374844 -1.824549 -1.159973
C  -5.743922 -0.908152 0.646279
C  2.969273 1.041662 -0.19781
C  -5.549185 -1.870904 -0.372529
C  5.797335 -0.931702 0.086201
H  -1.207358 3.139847 -0.452278
H  -1.149415 -1.017158 0.791811
H  1.304768 3.111545 -0.658965
H  1.353424 -1.047918 0.577576
H  -2.494834 -0.786389 -1.557813
H  -4.902042 0.842947 1.665459
H  -4.220854 -2.557649 -1.959739
H  -6.652199 -0.932266 1.258491
H  3.446499 1.990894 -0.499014
H  -6.30422 -2.643083 -0.553986
H  7.759019 -1.67274 -0.089231
H  7.565498 0.071032 -0.16107
H  4.194177 -2.113855 0.407441
H  5.731444 -2.935549 0.749202
