program: Gaussian 09
title: 000180994
version: EM64L-G09RevD.01
frameworkgroup: C1[X(C23H17ClF2O3)]
method: RPBEPBE
basis: SDD
operation: Freq
keyword: #p
keyword: freq=noraman
keyword: PBEPBE/SDD
title: #p freq=noraman PBEPBE/SDD
converged: YES YES NO NO
title: Mulliken charges:
elementType: Cl F F O O O C C C C C C C C C C C C C C C C C C C C C C C H H H H H H H H H H H H H H H H H
charge: -0.055887 -0.162855 -0.166899 -0.240723 -0.233694 -0.311655 -0.105140 0.300279 -0.596688 0.490360 0.267099 -0.363776 -0.405256 -0.213353 -0.217645 -0.485847 -0.107275 0.503673 -0.513840 -0.405411 0.343311 -0.197697 -0.392029 0.342698 -0.387017 -0.356939 -0.194116 -0.205780 -0.258079 0.273801 0.298838 0.251961 0.249693 0.259326 0.261156 0.245319 0.230601 0.275542 0.262664 0.232421 0.261440 0.257069 0.265431 0.229936 0.243476 0.231509
chargesum: 0.00000
title: Mulliken charges with hydrogens summed into heavy atoms:
elementType: Cl F F O O O C C C C C C C C C C C C C C C C C C C C C C C
charge: -0.055887 -0.162855 -0.166899 -0.240723 -0.233694 -0.311655 -0.105140 0.300279 -0.024049 0.490360 0.267099 -0.111815 -0.155563 0.045973 0.043511 -0.009927 -0.107275 0.503673 -0.238298 -0.142747 0.343311 0.034724 -0.130589 0.342698 -0.129948 -0.091508 0.035820 0.037695 -0.026569
polarizability: 2.96679212e+02 5.32263882e+01 2.84177294e+02 -6.27680061e+00 -3.32282825e+01 1.93733187e+02
1716.lowfreq: -4.7743 -0.7744 -0.0018 -0.0013 -0.0012 2.0756 13.0307 21.3334 29.0742
frequency: 12.6148 21.1871 29.0470 35.6236 37.7701 42.6075 48.1620 55.2608 72.4814 91.0113 114.2327 119.7903 145.9815 171.7246 184.1987 216.4338 218.2214 238.9061 248.9936 286.3049 294.3231 306.3344 327.8044 359.5655 361.1976 391.3955 403.6163 408.3558 412.4398 426.1263 444.6376 452.7880 469.9543 482.0409 519.6642 530.9903 563.2713 572.3236 595.7785 613.9445 621.5323 639.4906 648.1605 681.6520 690.1134 693.7869 716.0538 721.6784 737.4116 765.6696 796.1003 800.4943 815.7339 818.7011 830.0671 832.9664 840.1127 873.3935 887.6015 896.7199 912.1618 913.9452 934.1851 939.4469 952.2044 968.1192 972.3469 981.5422 986.5812 987.2861 993.0365 997.3009 1000.1129 1020.4156 1033.4451 1051.7154 1070.8492 1078.1227 1088.0256 1092.2114 1110.5743 1139.3753 1159.3749 1167.4536 1173.6849 1177.4714 1182.7361 1185.1718 1199.1149 1228.4230 1252.8784 1282.4019 1294.3938 1300.7351 1311.9917 1343.3128 1357.7327 1364.7213 1380.8102 1390.5467 1391.0433 1430.7077 1436.7728 1443.2635 1460.6719 1471.5838 1479.1841 1481.0748 1584.7165 1593.5905 1595.0965 1601.5427 1607.4934 1612.3460 1620.7326 3045.6395 3109.8328 3121.5941 3132.2249 3137.3741 3140.2724 3141.1284 3148.6913 3155.1820 3156.4180 3159.1734 3164.2828 3170.4798 3174.0629 3174.3408 3177.5578 3225.1982
redmass: 7.8097 5.8881 6.8364 5.8755 4.1587 6.1699 6.9062 7.1806 6.0438 9.3742 10.4302 6.9720 8.6002 7.0758 6.3152 9.9704 4.5504 6.1145 9.0483 5.9651 4.9053 6.2127 4.1195 5.7218 6.6691 2.9779 3.1177 3.0087 2.9460 4.2469 5.1711 6.4539 4.3349 3.4111 4.5229 3.5169 7.6202 6.7686 5.6844 6.5955 7.2211 5.5719 6.8171 5.8203 3.1222 2.3312 4.0232 2.9333 5.2061 1.5951 3.9680 2.9628 5.4035 2.1207 1.2806 1.5793 1.3051 2.5363 1.8847 1.6241 1.4465 1.4534 2.7839 6.7799 1.3745 1.3774 1.3583 1.4069 5.4691 5.2968 1.3083 2.5312 3.1122 2.1029 3.4311 3.9248 2.4946 1.5136 1.5440 1.3762 1.3618 1.9286 3.3705 1.1568 1.1165 1.2473 3.9172 1.1827 2.2329 1.1799 3.9020 3.5808 1.2838 1.3163 1.3160 1.3170 2.6919 5.8170 8.0351 8.5336 3.3567 1.5620 2.7108 2.3701 1.1333 2.2450 2.5688 2.6324 7.7866 6.2229 6.5761 6.2984 6.5871 6.5561 10.1868 1.0584 1.0553 1.1086 1.0852 1.0898 1.0871 1.0891 1.0920 1.0929 1.0892 1.0934 1.0966 1.0958 1.0996 1.0994 1.0976 1.1173
irintensity: 0.0399 0.2146 0.7162 0.5307 0.2595 0.0976 0.3950 1.0294 0.9595 1.3994 1.9306 0.7006 0.9905 1.0558 0.9487 1.7688 1.4192 4.4223 2.5729 0.9029 0.2723 0.7276 1.4060 3.4187 9.1320 16.9569 2.3341 1.6253 0.3823 2.7428 4.9516 15.5241 12.3550 13.8448 18.7772 20.4273 0.4595 3.9090 2.5532 0.7967 0.9092 7.6488 4.2008 9.4193 13.0164 36.7143 7.5029 5.9398 17.5318 97.2567 85.0733 23.5551 18.0397 2.8051 4.0418 47.8716 4.4542 19.6106 51.5660 7.2572 1.3009 7.0024 28.1104 238.4560 12.1334 0.6830 0.2907 0.9417 1.5313 1.2752 0.4120 15.8364 25.5318 13.8633 62.2633 60.4185 29.9445 11.1774 6.6403 23.6575 7.2117 2.6310 113.2660 32.7989 8.6124 58.5005 303.6601 16.1180 133.9625 9.7026 209.3285 63.2220 0.9515 3.5117 1.2892 17.6373 82.3396 5.9393 7.1810 8.2567 7.7685 73.7393 43.2913 17.0625 31.6639 133.3412 13.1930 85.1915 1.4543 48.8128 103.6917 3.4941 20.2327 2.8732 153.4531 27.8651 3.1239 3.1361 3.0620 4.7452 7.7162 2.7425 7.3701 22.5539 3.4853 5.2645 7.8279 2.7823 11.8934 6.7958 1.0624 1.1696
temp: 298.150 k
press: 1.00000 atm
elementType: 17 9 9 8 8 8 6 6 6 6 6 6 6 6 6 6 6 6 6 6 6 6 6 6 6 6 6 6 6 1 1 1 1 1 1 1 1 1 1 1 1 1 1 1 1 1
symmnumber: 1
zpe: 884960.1 jmol-1
zpe.correction: 0.337064 hartree
zpe.thermalcorrener: 0.362618 hartree
zpe.thermalcorrenthalpy: 0.363562 hartree
zpe.thermalcorrgfe: 0.277377 hartree
zpe.sumelectzpe: -1769.984521 hartree
zpe.sumelectthermal: -1769.958967 hartree
zpe.sumelectthermalent: -1769.958022 hartree
zpe.sumelectthermalfe: -1770.044207 hartree
dipole: 1.1451 -0.2924 0.7605
dipole: 1.4054
quadrupole: -183.8564 -175.7501 -161.8256
quadrupole: -0.0768 -12.8249 -4.9482
quadrupole: -10.0457 -1.9394 11.9851 -0.0768 -12.8249 -4.9482
hfenergy: -1770.3215843 hartree
pointgroup: C01 [X(C23H17Cl1F2O3)]
dipole: 0.3603629 -0.225135 -0.3537961 debye
polarizability: 231.7919246|-19.0360137|339.7194025|-22.6367114|-32.6633993|203.0783657 unknown
InChI: InChI=1S/C23H17ClF2O3/c24-18-11-9-17(10-12-18)22(15-23(22,25)26)21(27)28-14-16-5-4-8-20(13-16)29-19-6-2-1-3-7-19/h1-13H,14-15H2
charge 0 multiplicity 1
46 atoms
Cl -2.839146 -3.90374 -0.026361
F  -3.336551 4.170998 1.656371
F  -4.759081 2.401173 1.413998
O  -0.323242 1.963712 1.10938
O  -0.753028 3.895152 -0.130231
O  3.750407 -1.28493 -0.952284
C  -2.527953 2.225336 0.220083
C  -3.649191 3.061905 0.845411
C  -3.499199 3.130677 -0.635388
C  -2.652707 0.724741 0.167733
C  -1.126132 2.803184 0.357173
C  -2.85516 -0.032946 1.346544
C  -2.515193 0.054276 -1.07229
C  -2.919964 -1.441763 1.294402
C  -2.571046 -1.355247 -1.142793
C  1.127554 2.377351 1.259895
C  -2.772053 -2.079027 0.04786
C  1.955577 1.846662 0.112293
C  2.424939 0.510333 0.147396
C  2.264132 2.677055 -0.994574
C  3.184063 0.010382 -0.933681
C  3.042859 2.16782 -2.058655
C  3.504283 0.83496 -2.036561
C  3.126648 -2.375236 -0.284464
C  3.998574 -3.322693 0.293569
C  1.72582 -2.571897 -0.284878
C  3.457333 -4.483293 0.889275
C  1.198468 -3.735968 0.318276
C  2.058221 -4.69255 0.908012
H  -4.248771 2.62168 -1.246984
H  -3.043374 4.036347 -1.047801
H  -2.961287 0.475351 2.30963
H  -2.358933 0.630904 -1.991138
H  -3.079946 -2.029315 2.202645
H  -2.463053 -1.875151 -2.098967
H  1.161798 3.47772 1.321675
H  1.400931 1.920845 2.223372
H  2.199662 -0.129681 1.007078
H  1.885659 3.704072 -1.020499
H  3.289102 2.80917 -2.91151
H  4.108462 0.420522 -2.849069
H  5.076968 -3.140523 0.263802
H  1.059657 -1.840639 -0.753981
H  4.129995 -5.221922 1.338906
H  0.114759 -3.896555 0.316484
H  1.641737 -5.593253 1.371139
