program: Gaussian 09
title: 000180973
version: EM64L-G09RevD.01
frameworkgroup: C1[X(C19H38O)]
method: RPBEPBE
basis: SDD
operation: Freq
keyword: #pfreq=noraman
keyword: PBEPBE/SDD
title: #p freq=noraman PBEPBE/SDD
converged: YES YES NO NO
title: Mulliken charges:
elementType: O C C C C C C C C C C C C C C C C C C C H H H H H H H H H H H H H H H H H H H H H H H H H H H H H H H H H H H H H H
charge: -0.222248 -0.032781 -0.414450 -0.419335 -0.013885 -0.398872 -0.392477 -0.419321 -0.425895 -0.389667 -0.745295 -0.030988 -0.754819 -0.556423 0.228314 -0.729302 -0.718711 -0.181681 -0.697032 -0.688531 0.191445 0.183029 0.201639 0.224728 0.201328 0.195020 0.190167 0.177077 0.182217 0.198563 0.216426 0.201518 0.243632 0.204018 0.203015 0.184846 0.212272 0.211396 0.210340 0.194546 0.215530 0.218146 0.212206 0.240639 0.243047 0.199205 0.199414 0.252148 0.208489 0.210102 0.210492 0.217324 0.206851 0.232614 0.234975 0.231863 0.225329 0.217802
chargesum: 0.00000
title: Mulliken charges with hydrogens summed into heavy atoms:
elementType: O C C C C C C C C C C C C C C C C C C C
charge: -0.222248 0.158665 -0.029782 0.006721 0.181134 -0.031628 -0.011697 -0.001377 0.021755 -0.001806 -0.111287 0.163558 -0.108938 -0.072738 0.228314 -0.078534 -0.089627 0.035643 -0.022592 -0.013536
polarizability: 2.25641978e+02 -4.01264070e+00 2.26650064e+02 4.87931761e+00 8.28244407e-01 1.70394593e+02
1716.lowfreq: -19.2178 -9.8419 -0.0001 0.0007 0.0008 2.1221 7.3996 16.3763 27.6505
frequency: -8.8580 15.3659 27.4674 33.0261 34.7716 38.4325 57.7476 75.3841 85.2029 94.7724 104.5849 114.1119 117.3691 144.2936 175.7962 188.8103 199.8978 205.0422 206.8395 222.9618 229.2387 232.6539 233.7341 242.8989 244.4891 286.0079 291.8182 300.3241 322.7239 352.6061 353.6754 378.6443 412.3336 422.1330 427.8183 429.6835 508.0958 545.9509 557.8600 584.7691 629.8525 725.7226 734.1717 760.5142 768.2789 779.1626 804.9500 819.4128 837.5305 848.2270 880.8742 914.2699 921.2642 923.7993 931.1668 951.1900 953.1060 955.2287 964.0401 969.9611 973.7645 984.5915 988.5407 997.9685 1030.7606 1043.1523 1053.0586 1062.3821 1066.1582 1077.2830 1099.3708 1110.9779 1112.2316 1127.9305 1133.9028 1158.8115 1161.4099 1177.0782 1179.0862 1187.7725 1191.6662 1199.1069 1237.9679 1241.6730 1252.4431 1263.5646 1270.9410 1276.2298 1283.4383 1289.3835 1297.3537 1299.9470 1305.6736 1321.6771 1327.6281 1331.2867 1334.3541 1341.9375 1347.6003 1348.9868 1358.5917 1359.6708 1363.1770 1376.1298 1377.3905 1383.8066 1387.1070 1393.0196 1394.6650 1434.4210 1454.4743 1459.6441 1462.7783 1463.7447 1465.5090 1465.7702 1470.2019 1473.5497 1474.0586 1475.0539 1476.2741 1478.8507 1481.0313 1483.0430 1484.3053 1484.9164 1487.0065 1489.8335 1491.1865 1623.1243 2938.2882 2943.6755 2943.9877 2952.4725 2953.4655 2954.7113 2959.4791 2961.2496 2963.1673 2965.9905 2966.8908 2968.3968 2969.9720 2972.2862 2974.8766 2980.4552 2985.9185 2988.4349 2992.7494 2995.5374 3000.8922 3004.2677 3023.1024 3035.9332 3041.6171 3052.8705 3055.2077 3059.4315 3061.9771 3063.5588 3064.1117 3064.4826 3064.5400 3068.7254 3076.6689 3083.1006 3086.0226 3094.9670
redmass: 3.4505 3.2363 3.5100 3.1202 3.7085 4.6733 2.5099 2.4976 2.8127 2.7426 2.7862 1.8887 2.9080 1.9942 2.2128 1.1924 2.1422 1.6174 1.3433 1.6427 1.0887 1.1290 1.2639 1.4927 2.3378 2.7586 2.5918 3.4449 2.5786 2.1769 2.0289 2.3597 2.4947 2.6697 2.6044 2.5185 2.4234 2.3549 2.2414 2.4025 2.9193 1.1803 1.1425 1.6070 2.7472 2.6756 1.7754 2.0286 1.6210 1.9565 2.6840 1.1798 1.6766 1.2400 1.6936 1.4777 1.6045 1.5778 1.4912 1.7605 1.9488 2.1333 1.9085 2.0148 1.6167 1.5542 2.1259 2.3533 2.4050 1.4410 1.9578 1.9106 1.8620 1.8579 1.9600 2.1631 2.0982 1.6416 1.8270 1.5385 1.8918 1.4917 1.3496 1.3534 1.3707 1.2297 1.2327 1.3314 1.0986 1.1607 1.3009 1.2852 1.3578 1.4718 1.4883 1.4420 1.4622 1.6455 1.5026 1.5748 1.4598 1.4348 1.4581 1.2084 1.2083 1.2217 1.2182 1.2150 1.2055 1.0859 1.0728 1.0691 1.0558 1.0669 1.0740 1.0495 1.0482 1.0589 1.0579 1.0721 1.0560 1.0507 1.0656 1.0587 1.0820 1.0611 1.0718 1.0585 1.0551 7.8997 1.0758 1.0669 1.0654 1.0705 1.0606 1.0701 1.0622 1.0654 1.0367 1.0636 1.0364 1.0422 1.0416 1.0577 1.0801 1.0353 1.0699 1.0371 1.0941 1.0942 1.0992 1.1011 1.0909 1.1040 1.1027 1.0991 1.0973 1.0989 1.0996 1.0990 1.0993 1.0991 1.0988 1.0997 1.1001 1.0999 1.1009 1.0994
irintensity: 0.4572 1.5866 0.2251 1.5818 0.0733 1.7498 0.0267 1.3624 0.4214 0.3688 0.3640 0.0434 1.3636 0.2897 0.1780 0.1337 0.1905 0.2403 0.2351 0.0102 0.2025 0.5169 0.7400 1.1466 1.4099 0.2298 0.1025 9.6265 0.2138 0.1194 0.0052 0.4017 0.1007 0.3123 0.6905 0.0624 0.4229 5.6696 6.2030 1.1188 5.6748 8.9513 8.7767 6.2877 2.9823 2.9893 1.2318 1.4097 1.4492 1.5102 3.3962 1.1464 9.2708 1.1769 3.1508 0.0773 3.2479 0.7601 2.9244 1.1921 1.2548 0.3482 3.4349 3.5456 6.4704 0.1732 37.7376 12.6798 4.3365 8.0047 20.2984 2.9836 6.5864 3.3735 2.3228 2.9645 4.5017 6.7305 1.1893 7.7246 7.9277 1.7190 5.1215 17.7035 39.6196 5.4591 1.8263 3.5581 1.1866 0.9378 20.1773 0.5614 6.3121 0.2155 0.4233 3.8384 2.9495 11.9908 2.1082 1.6982 1.0706 9.6435 6.9192 3.7532 39.3847 20.8410 21.2089 15.3092 19.5358 8.4110 2.1513 3.5743 6.5179 0.5062 3.6151 3.1764 3.6026 10.2820 1.4109 6.6681 9.0709 18.0641 1.6313 3.7722 10.8646 11.8654 40.2266 33.0182 10.7793 91.0337 16.1005 12.1991 5.6892 27.9657 17.6763 3.5538 34.5520 19.0849 31.3442 76.1198 34.7418 37.5267 26.6323 73.7891 22.0166 28.3385 35.6855 25.2145 24.4590 44.7070 8.5887 3.9298 12.0621 103.9402 124.0123 29.0664 22.3087 58.5354 34.5705 89.8055 46.2308 71.8975 74.5046 37.3308 29.0738 43.4855 18.4736 32.6622
temp: 298.150 k
press: 1.00000 atm
elementType: 8 6 6 6 6 6 6 6 6 6 6 6 6 6 6 6 6 6 6 6 1 1 1 1 1 1 1 1 1 1 1 1 1 1 1 1 1 1 1 1 1 1 1 1 1 1 1 1 1 1 1 1 1 1 1 1 1 1
symmnumber: 1
zpe: 1386872.4 jmol-1
zpe.correction: 0.528232 hartree
zpe.thermalcorrener: 0.554227 hartree
zpe.thermalcorrenthalpy: 0.555171 hartree
zpe.thermalcorrgfe: 0.470312 hartree
zpe.sumelectzpe: -820.373104 hartree
zpe.sumelectthermal: -820.347109 hartree
zpe.sumelectthermalent: -820.346165 hartree
zpe.sumelectthermalfe: -820.431023 hartree
dipole: -1.8283 -1.0367 -1.7054
dipole: 2.7067
quadrupole: -120.3851 -130.1869 -132.6225
quadrupole: -0.2765 3.2628 -1.9154
quadrupole: 7.3464 -2.4553 -4.8910 -0.2765 3.2628 -1.9154
hfenergy: -820.9013355 hartree
pointgroup: C01 [X(C19H38O1)]
dipole: 0.7253901 0.2860955 -0.7252139 debye
polarizability: 223.4009646|-3.6415581|227.9013089|-8.7710949|0.1976322|171.3843618 unknown
InChI: InChI=1S/C19H38O/c1-15(2)9-7-10-17(5)11-8-12-18(6)13-14-19(20)16(3)4/h15-18H,7-14H2,1-6H3
charge 0 multiplicity 1
58 atoms
O  1.78814 -1.378239 0.999037
C  -3.383074 2.004527 -0.019074
C  -2.082102 2.305224 -0.821368
C  -0.781726 2.375247 0.013788
C  1.789307 2.82665 -0.062982
C  0.445691 2.764148 -0.842086
C  -3.300566 0.708317 0.833699
C  -2.975496 -0.580052 0.043484
C  2.222522 1.455155 0.529766
C  -2.955848 -1.828026 0.958232
C  -3.794993 3.205408 0.868632
C  -2.62546 -3.180858 0.264201
C  2.902684 3.451723 -0.939212
C  2.579021 0.373334 -0.514057
C  2.529113 -1.059915 0.028826
C  -1.215485 -3.184661 -0.375884
C  -3.705815 -3.591197 -0.766416
C  3.423249 -2.094961 -0.675635
C  2.850427 -3.523051 -0.576533
C  4.845833 -2.011372 -0.042576
H  -4.189568 1.854067 -0.770542
H  -2.21877 3.268457 -1.357155
H  -1.950883 1.535028 -1.609211
H  -0.604611 1.393661 0.493699
H  -0.894704 3.111448 0.835357
H  1.627782 3.502371 0.805139
H  0.26101 3.75827 -1.300669
H  0.53714 2.055708 -1.693225
H  -4.272695 0.571512 1.353113
H  -2.54611 0.842424 1.636806
H  -1.989851 -0.47329 -0.449633
H  -3.72408 -0.708981 -0.76474
H  1.424657 1.051646 1.179377
H  3.10112 1.613886 1.186989
H  -2.212102 -1.656748 1.764388
H  -3.944155 -1.918553 1.457426
H  -4.765542 3.015954 1.364748
H  -3.048384 3.393005 1.663318
H  -3.893708 4.13135 0.271048
H  -2.625048 -3.949571 1.066983
H  2.637687 4.482604 -1.239965
H  3.06213 2.868395 -1.866319
H  3.866128 3.493833 -0.396296
H  1.847488 0.394182 -1.35217
H  3.565764 0.554668 -0.98072
H  -1.173212 -2.508177 -1.251217
H  -0.949577 -4.199671 -0.728553
H  -0.442708 -2.85652 0.344028
H  -3.505969 -4.60321 -1.166497
H  -4.713722 -3.598671 -0.309374
H  -3.727981 -2.893236 -1.624489
H  3.511522 -1.795122 -1.74053
H  3.535504 -4.248526 -1.05182
H  1.865525 -3.596847 -1.071303
H  2.711224 -3.806177 0.48119
H  4.808732 -2.311282 1.020112
H  5.532743 -2.696128 -0.571565
H  5.268604 -0.991458 -0.100371
