program: Gaussian 09
title: 000180884
version: EM64L-G09RevD.01
frameworkgroup: C1[X(C17H32N2O)]
method: RPBEPBE
basis: SDD
operation: Freq
keyword: #p
keyword: freq=noraman
keyword: PBEPBE/SDD
title: #p freq=noraman PBEPBE/SDD
converged: NO YES NO NO
title: Mulliken charges:
elementType: O N N C C C C C C C C C C C C C C C C C H H H H H H H H H H H H H H H H H H H H H H H H H H H H H H H H
charge: -0.178814 -0.388006 -0.013437 -0.386557 -0.386382 -0.385995 -0.386689 -0.385009 -0.385273 -0.382066 -0.386479 -0.372929 -0.370364 -0.353420 -0.366086 -0.356708 -0.568400 -0.696548 0.254275 -0.059405 0.194245 0.194267 0.193525 0.193493 0.193330 0.193287 0.195288 0.195280 0.193280 0.193249 0.193208 0.193240 0.191720 0.191765 0.198413 0.198432 0.189492 0.189479 0.189982 0.189907 0.187497 0.187515 0.225444 0.225290 0.194835 0.194828 0.246648 0.246859 0.209524 0.209511 0.215090 0.346369
chargesum: 0.00000
title: Mulliken charges with hydrogens summed into heavy atoms:
elementType: O N N C C C C C C C C C C C C C C C C C
charge: -0.178814 -0.041636 -0.013437 0.001955 0.000636 0.000622 0.003879 0.001520 0.001175 0.001418 0.010366 0.006041 0.009526 0.021593 0.084648 0.032954 -0.074893 -0.062423 0.254275 -0.059405
polarizability: 2.93124920e+02 -3.14451783e+00 1.70690896e+02 2.76526273e-02 1.79580704e-02 1.46873082e+02
1716.lowfreq: -16.2773 -2.4617 -0.0023 -0.0004 0.0007 5.9916 13.7665 14.1347 28.6343
frequency: 10.4570 13.7654 21.6266 32.9442 39.6607 48.4468 61.1083 72.8002 76.2991 83.3974 99.8285 108.6901 113.2153 122.1359 126.0923 129.3333 146.7982 147.8992 161.5749 162.0201 163.0757 207.9455 225.4225 233.4418 269.6192 333.6812 345.1816 399.5283 416.8568 440.8740 465.3821 473.4524 499.5357 506.5471 542.0847 572.5504 709.2653 722.5770 723.4122 724.6969 727.5943 735.9667 752.0763 777.0059 809.6124 847.0400 887.1214 887.7843 910.4321 929.9174 970.7264 971.0064 976.5682 993.1857 1004.5350 1008.1380 1026.0363 1036.7308 1037.5802 1055.1112 1066.1322 1077.5754 1079.6876 1080.0116 1082.6617 1084.0924 1102.8734 1111.1306 1124.4492 1147.5996 1180.8293 1194.5477 1199.1645 1214.0838 1222.1778 1235.3082 1243.4562 1255.9611 1263.6482 1273.9939 1279.2100 1283.5290 1283.8603 1288.7139 1290.0483 1296.9025 1297.7383 1302.1437 1303.3319 1303.8717 1322.2656 1338.0375 1349.7556 1354.1560 1356.2130 1357.2580 1359.5299 1363.9881 1388.0152 1410.9902 1441.7441 1460.4932 1460.6070 1462.4631 1462.9937 1464.7183 1465.3228 1467.3716 1470.9923 1475.0607 1475.8408 1479.1795 1483.1819 1486.7276 1489.4031 1490.6825 1670.6662 2208.9039 2949.3584 2949.4324 2949.9860 2950.7283 2951.2399 2952.5336 2953.2652 2956.4618 2960.1965 2962.1341 2963.9387 2967.1305 2969.1553 2970.9401 2982.3957 2984.1603 2986.5953 2989.7437 2993.8424 2999.2313 3000.7970 3006.9798 3009.9092 3016.0975 3024.7287 3032.7628 3039.6811 3044.6948 3065.5307 3067.4830 3069.7049 3517.8038
redmass: 5.8158 5.0099 4.0486 3.5030 4.7382 3.2057 1.6549 2.3932 4.6945 1.8967 2.0817 2.2765 5.2111 5.1161 1.9430 2.6259 2.2498 1.9296 5.0315 2.1050 1.9770 4.4334 1.1337 4.7670 3.7661 3.7033 3.9009 3.7460 5.7853 3.9054 3.2178 4.3727 3.1366 3.0464 1.4061 2.5308 5.5308 1.0582 1.0625 1.0687 1.0894 1.1165 1.1556 1.2027 1.2436 1.2721 1.9045 1.2760 7.6840 1.2571 6.0174 1.2155 5.6458 4.7434 4.4042 1.1483 4.0011 1.0620 3.3603 3.2953 2.9599 2.4534 2.1619 2.3685 2.1613 2.2272 3.1014 1.3911 3.2118 2.6768 1.9432 1.6934 1.2628 1.5114 1.3158 1.3942 1.3210 1.3119 1.3199 1.2397 1.0163 1.0386 1.3273 1.1628 1.0518 1.0739 1.1359 1.1003 1.1171 1.3519 1.3931 1.4452 1.5098 1.7116 1.6334 1.6408 1.6270 1.6514 1.2173 1.5402 1.1055 1.0732 1.0732 1.0715 1.0709 1.0718 1.0594 1.0809 1.0839 1.0846 1.0425 1.0877 1.0921 1.0953 1.0971 1.0987 7.8506 12.3461 1.0584 1.0585 1.0587 1.0589 1.0588 1.0591 1.0594 1.0595 1.0593 1.0592 1.0589 1.0584 1.0580 1.0372 1.0959 1.0965 1.0973 1.0986 1.1002 1.1019 1.0601 1.1029 1.0995 1.1046 1.1051 1.1051 1.1049 1.1045 1.1039 1.1007 1.0992 1.0768
irintensity: 0.1634 0.7423 1.4752 4.9127 1.8069 4.6537 0.0005 1.8738 2.0635 0.3802 0.4906 0.6204 0.3196 1.1729 0.1043 0.1966 0.0003 0.0292 1.2236 0.0012 0.0125 3.5001 0.0011 0.3505 2.2885 0.0615 2.0222 0.2650 0.4432 2.4838 1.0114 3.7004 0.7729 0.9677 60.2150 51.0311 8.6107 16.2882 1.6152 18.3823 0.0859 3.9082 0.0968 3.0680 0.2038 2.5824 4.9971 0.1150 2.1456 1.4861 17.8106 0.0159 0.8465 24.4825 0.0694 0.5755 3.8342 0.0015 1.6553 0.7449 3.7986 8.6186 0.3635 1.4645 0.0313 4.4778 0.3430 0.3149 8.8963 136.7698 0.0714 0.0587 50.9099 0.0162 7.0357 0.0137 11.0748 0.0197 7.1116 0.0006 0.0646 0.2317 6.9695 0.0722 0.0753 0.2010 0.0000 0.0037 0.0750 5.9654 3.9767 4.1196 0.8539 0.8006 1.6796 0.4137 0.3680 2.6412 11.2479 281.8219 41.0225 0.0335 0.0379 0.1058 0.0347 0.2362 0.0048 0.9023 0.4295 2.0893 12.3291 1.3087 1.6338 2.5810 1.3721 52.1868 127.1954 101.4017 0.0662 0.5247 2.0860 0.7423 2.2061 4.4970 0.2253 0.9143 2.3877 20.6793 7.6058 154.7307 264.8652 33.4098 0.0755 0.2699 0.8384 1.2912 1.5797 1.0869 26.6909 1.4884 5.7949 0.9072 0.0015 14.2360 1.7027 358.5702 76.0566 104.4185 55.6313 34.0529
temp: 298.150 k
press: 1.00000 atm
elementType: 8 7 7 6 6 6 6 6 6 6 6 6 6 6 6 6 6 6 6 6 1 1 1 1 1 1 1 1 1 1 1 1 1 1 1 1 1 1 1 1 1 1 1 1 1 1 1 1 1 1 1 1
symmnumber: 1
zpe: 1211346.6 jmol-1
zpe.correction: 0.461378 hartree
zpe.thermalcorrener: 0.487223 hartree
zpe.thermalcorrenthalpy: 0.488167 hartree
zpe.thermalcorrgfe: 0.399696 hartree
zpe.sumelectzpe: -850.100138 hartree
zpe.sumelectthermal: -850.074293 hartree
zpe.sumelectthermalent: -850.073349 hartree
zpe.sumelectthermalfe: -850.161820 hartree
dipole: 4.6510 -4.7180 -0.0063
dipole: 6.6250
quadrupole: -210.2241 -127.6291 -123.7423
quadrupole: 42.1473 0.0487 0.0100
quadrupole: -56.3589 26.2360 30.1229 42.1473 0.0487 0.0100
hfenergy: -850.5615159 hartree
pointgroup: C01 [X(C17H32N2O1)]
dipole: 1.8298668 1.8561058 0.0132556 debye
polarizability: 293.1220143|3.1483766|170.68822|-0.6365767|0.2455617|146.8786633 unknown
InChI: InChI=1S/C17H32N2O/c1-2-3-4-5-6-7-8-9-10-11-12-13-14-15-17(20)19-16-18/h19H,2-15H2,1H3
charge 0 multiplicity 1
52 atoms
O  -7.470361 -1.419154 0.030145
N  -8.559849 0.649918 0.061406
N  -10.934569 -0.29648 0.062294
C  2.90615 -0.391014 -0.002526
C  1.632525 0.484107 0.009787
C  4.21449 0.431443 -0.002066
C  0.324445 -0.338699 0.00938
C  5.488247 -0.44351 -0.01408
C  -0.948985 0.536641 0.02213
C  6.796588 0.378978 -0.013005
C  -2.255918 -0.287627 0.021182
C  8.070487 -0.495961 -0.024971
C  -3.529238 0.587873 0.034727
C  9.379042 0.326262 -0.022864
C  -4.828701 -0.246206 0.032608
C  10.652902 -0.549595 -0.035444
C  -6.089463 0.63948 0.047727
C  11.955229 0.27986 -0.032409
C  -7.38404 -0.172825 0.044933
C  -9.821062 0.143835 0.061851
H  2.896627 -1.064127 0.880373
H  2.888802 -1.050682 -0.895407
H  1.642408 1.157154 -0.873244
H  1.650284 1.143682 0.902821
H  4.224344 1.104478 -0.885112
H  4.231964 1.091223 0.890828
H  0.307011 -0.998047 -0.883624
H  0.315143 -1.011931 0.892075
H  5.471235 -1.103093 -0.907086
H  5.478444 -1.116823 0.868718
H  -0.930928 1.195509 0.915705
H  -0.938745 1.209957 -0.860716
H  6.81377 1.038524 0.880068
H  6.806638 1.052363 -0.895783
H  -2.265239 -0.961227 0.903176
H  -2.273496 -0.945975 -0.872143
H  8.053782 -1.155066 -0.918418
H  8.060237 -1.169839 0.857473
H  -3.516643 1.261738 -0.84802
H  -3.508988 1.245353 0.929627
H  9.397637 0.98503 0.870821
H  9.390859 1.000483 -0.905054
H  -4.85544 -0.902512 -0.857667
H  -4.846898 -0.920373 0.909649
H  10.639581 -1.223374 0.84572
H  10.63327 -1.206977 -0.92881
H  -6.082328 1.296071 0.942775
H  -6.090351 1.314956 -0.833158
H  12.013231 0.922363 0.866726
H  12.005911 0.9403 -0.918902
H  12.850577 -0.368958 -0.042587
H  -8.44842 1.667591 0.073574
