program: Gaussian 09
title: 000180881
version: EM64L-G09RevD.01
frameworkgroup: C1[X(C15H12O)]
method: RPBEPBE
basis: SDD
operation: Freq
keyword: #pfreq=noraman
keyword: PBEPBE/SDD
title: #p freq=noraman PBEPBE/SDD
converged: YES YES NO NO
title: Mulliken charges:
elementType: O C C C C C C C C C C C C C C C H H H H H H H H H H H H
charge: -0.293154 0.156392 0.168297 0.138502 0.189293 0.309921 -0.822715 -0.407762 -0.351457 -0.244097 -0.382076 -0.372851 -0.219454 -0.244794 -0.231473 -0.244458 0.245983 0.239141 0.235419 0.235405 0.251303 0.224046 0.244825 0.264540 0.227790 0.226061 0.227334 0.230040
chargesum: 0.00000
title: Mulliken charges with hydrogens summed into heavy atoms:
elementType: O C C C C C C C C C C C C C C C
charge: -0.293154 0.156392 0.168297 0.138502 0.189293 0.309921 -0.102173 -0.172357 -0.100154 -0.020051 -0.137250 -0.108312 0.008337 -0.018733 -0.004139 -0.014418
polarizability: 3.04947163e+02 -3.21776866e+00 1.65728658e+02 -5.31292717e-01 -3.49104646e+00 6.93412762e+01
1716.lowfreq: -6.0691 -0.0004 -0.0003 0.0005 3.9229 8.0168 29.6858 61.7977 110.0104
frequency: 29.5389 61.7937 110.0066 147.7980 171.6335 189.7336 253.1125 287.4160 294.2335 313.7396 347.1332 404.7879 429.7079 494.8848 521.0874 570.6102 571.8364 574.6558 615.3216 658.5011 668.6104 697.8524 702.1457 750.0457 759.0517 776.0584 796.0523 850.9690 855.1230 855.8645 925.1790 935.5018 974.9580 980.2626 986.7548 997.2069 998.4280 1007.1681 1036.2398 1037.7556 1053.9052 1065.4597 1099.5553 1113.9994 1163.6336 1174.3618 1191.0062 1197.4733 1258.0115 1292.8761 1322.2934 1368.2381 1381.3890 1402.9970 1412.4948 1432.8397 1442.3039 1464.1854 1477.0320 1482.5139 1486.7014 1576.8517 1590.4598 1595.7913 1616.9191 1622.9840 2973.1237 3052.7032 3082.3227 3127.3116 3129.9804 3138.1195 3143.3711 3156.7330 3159.1794 3171.3014 3174.8416 3178.2904
redmass: 3.1889 5.4962 4.5159 2.7295 1.9886 1.8825 2.6434 5.6695 5.2730 5.0264 4.2981 2.8318 3.0339 3.5374 5.3235 5.8708 4.0637 5.3615 6.4191 4.6663 6.5912 1.8423 5.3346 2.0490 1.8936 1.9388 4.4745 1.2935 1.5764 3.5294 1.4384 1.3783 1.3042 1.4130 5.3886 3.2982 1.3652 2.1981 1.9677 1.5345 2.4902 3.2553 1.8551 1.6641 1.1779 1.0529 1.7982 1.3346 2.2592 2.1008 1.4117 3.0742 6.0539 1.3291 4.3467 2.5556 2.6742 2.0827 1.1708 1.7048 1.4623 5.7878 7.3326 7.6994 6.3217 7.8057 1.0392 1.0954 1.0986 1.0850 1.0857 1.0896 1.0905 1.0950 1.0956 1.0948 1.0988 1.0971
irintensity: 0.2141 1.2328 0.2257 1.2952 1.4149 0.2756 0.9032 0.0140 0.2850 0.5267 0.6011 0.0230 3.3934 9.9034 3.8401 1.3349 0.8536 2.4369 0.0911 5.9025 5.7596 47.8200 3.9973 53.3654 73.3788 39.6932 13.3310 0.2718 0.4441 2.9850 4.6255 3.4647 0.0383 0.3834 1.4918 25.6131 2.0825 4.8007 4.5031 7.4679 24.0317 2.4420 2.7985 7.1448 0.5616 0.1671 17.3296 4.2792 7.7007 3.0358 1.5194 3.0537 1.4307 17.8471 28.7826 12.8496 13.4214 4.3786 10.9800 35.7807 7.3091 2.4676 0.0104 0.3648 15.6788 4.7187 27.9800 18.0130 19.7151 1.7219 2.1050 14.7107 12.4025 36.7037 26.1421 17.4094 19.0636 9.0398
temp: 298.150 k
press: 1.00000 atm
elementType: 8 6 6 6 6 6 6 6 6 6 6 6 6 6 6 6 1 1 1 1 1 1 1 1 1 1 1 1
symmnumber: 1
zpe: 582655.0 jmol-1
zpe.correction: 0.221922 hartree
zpe.thermalcorrener: 0.234515 hartree
zpe.thermalcorrenthalpy: 0.235459 hartree
zpe.thermalcorrgfe: 0.182344 hartree
zpe.sumelectzpe: -652.928170 hartree
zpe.sumelectthermal: -652.915576 hartree
zpe.sumelectthermalent: -652.914632 hartree
zpe.sumelectthermalfe: -652.967747 hartree
dipole: 0.1481 1.3074 0.1164
dipole: 1.3209
quadrupole: -78.9896 -81.2726 -99.8458
quadrupole: 0.4319 -0.1742 -1.1143
quadrupole: 7.7131 5.4300 -13.1431 0.4319 -0.1742 -1.1143
hfenergy: -653.1500911 hartree
pointgroup: C01 [X(C15H12O1)]
dipole: -0.057986 -0.5151138 0.0370754 debye
polarizability: 304.9459684|-3.1369959|165.581926|1.2840812|5.0731669|69.4892032 unknown
InChI: InChI=1S/C15H12O/c1-11-13-9-5-6-10-14(13)16-15(11)12-7-3-2-4-8-12/h2-10H,1H3
charge 0 multiplicity 1
28 atoms
O  0.404796 1.151918 -0.055447
C  0.566126 -1.164929 0.058829
C  1.909304 -0.602591 0.038578
C  -0.319594 -0.087512 -0.005419
C  1.767128 0.813077 -0.029586
C  -1.776137 0.051856 -0.009084
C  0.251877 -2.635213 0.16504
C  3.215489 -1.154873 0.078747
C  2.843413 1.709365 -0.064157
C  4.317467 -0.274438 0.046362
C  -2.634502 -1.058245 -0.2592
C  -2.36853 1.325655 0.236994
C  4.13627 1.13718 -0.024772
C  -4.035499 -0.900008 -0.244462
C  -3.768834 1.477525 0.246397
C  -4.612345 0.365633 0.011048
H  -0.574067 -2.829629 0.872221
H  -0.03352 -3.071471 -0.811962
H  1.135047 -3.191414 0.524093
H  3.370584 -2.238094 0.130172
H  2.688752 2.790603 -0.117364
H  5.3349 -0.679554 0.074885
H  -2.212188 -2.039489 -0.490283
H  -1.717088 2.185041 0.4196
H  5.013894 1.792081 -0.049269
H  -4.678414 -1.765023 -0.442272
H  -4.204777 2.464146 0.43916
H  -5.701252 0.485209 0.020051
