program: Gaussian 09
title: 000180904
version: EM64L-G09RevD.01
frameworkgroup: C1[X(C19H20N2O3)]
method: RPBEPBE
basis: SDD
operation: Freq
keyword: #p
keyword: freq=noraman
keyword: PBEPBE/SDD
title: #p freq=noraman PBEPBE/SDD
converged: YES YES NO NO
title: Mulliken charges:
elementType: O O O N N C C C C C C C C C C C C C C C C C C C H H H H H H H H H H H H H H H H H H H H
charge: -0.219961 -0.267136 -0.265558 -0.418005 -0.060788 0.173236 0.505211 -0.742184 -0.751781 0.252285 -0.650448 -0.401210 -0.379101 0.171989 0.102073 0.176342 -0.240690 -0.246761 -0.502089 -0.243047 -0.337414 0.311246 -0.316492 -0.537739 0.323828 0.223509 0.268043 0.207633 0.219823 0.232929 0.243153 0.245993 0.263573 0.235465 0.233953 0.222517 0.223582 0.296664 0.227768 0.258452 0.258562 0.231983 0.225703 0.244887
chargesum: 0.00000
title: Mulliken charges with hydrogens summed into heavy atoms:
elementType: O O O N N C C C C C C C C C C C C C C C C C C C
charge: -0.219961 -0.267136 -0.265558 -0.094177 -0.060788 0.173236 0.505211 -0.042999 -0.055875 0.252285 -0.140882 -0.165745 -0.145148 0.171989 0.102073 0.176342 -0.018174 -0.023179 -0.205425 -0.015280 -0.078962 0.311246 -0.057930 0.164835
polarizability: 2.60553572e+02 -8.36170829e+00 2.38890709e+02 3.90437386e+01 7.03809983e+00 1.68517363e+02
1716.lowfreq: -16.3979 -7.7610 -1.0310 -0.0007 -0.0006 0.0003 8.5637 16.3343 21.3525
frequency: -9.8031 15.9486 20.7205 29.8256 53.1053 78.3214 89.9169 126.0498 134.3350 150.6158 158.5838 177.8575 210.3378 241.8144 243.7109 251.1064 270.6870 281.8919 292.7028 323.2668 343.1319 346.3261 379.5310 398.8354 401.6791 403.4540 430.3633 466.8769 488.4984 498.7298 517.3177 542.0152 552.4426 558.6911 569.5239 608.8330 617.7649 644.5934 666.9089 701.7130 717.8500 730.7939 740.4212 771.1477 782.7058 789.1227 818.3317 829.2387 848.6661 869.5337 873.8224 898.1186 900.7380 917.9113 932.1649 943.3612 952.3792 974.8488 982.3775 988.0000 990.4757 994.0100 1012.5753 1026.4341 1055.1005 1081.3320 1108.4660 1114.2492 1118.4167 1130.3597 1156.9482 1172.0941 1174.2048 1179.2381 1190.5468 1196.3861 1221.8387 1245.6775 1268.8064 1269.4545 1277.2063 1318.8998 1344.6013 1376.8449 1379.9399 1395.6201 1408.3041 1414.3427 1435.2462 1437.5153 1448.6907 1462.0060 1463.8919 1466.3026 1467.5760 1475.5255 1478.8116 1482.9473 1483.3822 1490.3443 1494.1989 1592.8816 1600.9779 1613.6216 1619.8089 1625.7371 2964.3131 2978.7687 2993.9543 3020.0232 3053.5805 3073.1197 3085.2102 3089.3336 3100.8693 3112.5027 3117.4476 3126.6159 3130.1458 3139.4200 3153.4225 3163.7150 3165.8669 3173.1184 3186.1670 3518.5360
redmass: 4.7756 4.7077 5.3527 4.0690 5.5835 5.5886 5.0476 3.9684 3.5438 4.0069 4.7648 3.7969 1.8913 1.2187 1.5238 3.2219 1.3397 2.2773 3.5816 2.7273 3.6575 3.9488 6.1001 5.7559 2.8743 3.2336 3.1126 5.6950 2.9142 4.8368 3.3736 3.5266 1.5572 2.9820 3.9214 4.3431 6.2315 4.8756 4.8867 1.6721 4.6412 6.4842 5.0277 1.9514 8.0280 5.9937 1.4816 6.6870 1.2560 1.5265 2.6890 4.0608 3.6135 1.5556 1.4927 2.4668 1.3282 1.4008 2.4399 4.4177 4.7646 1.3922 1.3738 2.3640 3.8566 1.6446 2.0322 1.2621 1.3869 1.2834 1.3724 1.0574 2.6900 2.5652 1.3919 1.8062 5.3075 2.9142 3.0281 1.3590 1.4084 1.3484 4.0016 1.2797 5.7940 1.2157 2.9415 8.1629 2.2121 1.4162 1.1538 1.1379 1.0655 1.1107 1.7486 1.2231 1.5451 2.2876 1.9248 1.3851 1.2527 6.1422 8.9336 6.1786 7.0723 6.7935 1.0329 1.0365 1.0359 1.0595 1.1041 1.1002 1.0995 1.1029 1.0983 1.1005 1.0852 1.0870 1.1000 1.0930 1.0952 1.0886 1.1000 1.0928 1.0976 1.0779
irintensity: 1.8984 2.0315 0.2902 1.4119 2.3509 7.8483 3.7743 0.6736 1.4159 1.5562 9.5800 4.5528 0.6109 0.1745 2.3008 5.5688 0.5546 1.0891 1.4410 2.5453 0.5631 0.1680 0.9333 0.6321 0.1346 1.6842 3.8940 7.5710 6.5683 4.2153 8.4501 31.3268 63.2834 40.1932 4.0387 4.5029 0.1853 3.6361 18.8783 51.5763 4.2472 6.7884 2.9857 44.5419 17.7527 10.8659 47.4944 14.6663 0.2829 35.1428 0.6685 1.5711 4.9295 0.1689 2.5178 22.9136 0.0296 0.2555 2.8567 36.3092 0.4919 0.5711 0.1906 14.8548 3.0469 11.5810 10.1572 0.0777 6.1731 14.8549 0.9043 0.0515 15.2593 58.1038 25.7030 15.6931 90.5081 12.5006 179.2963 9.5812 6.5829 3.7933 45.6006 27.4888 3.5810 37.4063 55.6442 2.3825 11.7267 10.5540 57.4700 52.2963 11.1949 16.4895 44.3240 81.8465 11.2145 89.0855 32.4947 33.2452 82.3423 2.5143 1.1655 9.1623 83.9527 71.2952 42.2791 22.3571 18.4188 11.2810 41.8242 28.9849 39.9865 3.6784 24.0335 10.0044 6.7321 0.8626 25.2782 28.3309 38.3104 1.2091 16.0284 3.7857 5.6619 18.7260
temp: 298.150 k
press: 1.00000 atm
elementType: 8 8 8 7 7 6 6 6 6 6 6 6 6 6 6 6 6 6 6 6 6 6 6 6 1 1 1 1 1 1 1 1 1 1 1 1 1 1 1 1 1 1 1 1
symmnumber: 1
zpe: 919076.1 jmol-1
zpe.correction: 0.350058 hartree
zpe.thermalcorrener: 0.371435 hartree
zpe.thermalcorrenthalpy: 0.372380 hartree
zpe.thermalcorrgfe: 0.298358 hartree
zpe.sumelectzpe: -1069.430521 hartree
zpe.sumelectthermal: -1069.409143 hartree
zpe.sumelectthermalent: -1069.408199 hartree
zpe.sumelectthermalfe: -1069.482220 hartree
dipole: -1.7268 1.2838 0.9096
dipole: 2.3361
quadrupole: -137.3777 -141.1178 -135.3776
quadrupole: 9.3946 1.2524 0.0575
quadrupole: 0.5800 -3.1601 2.5801 9.3946 1.2524 0.0575
hfenergy: -1069.7805788 hartree
pointgroup: C01 [X(C19H20N2O3)]
dipole: -0.7961422 -0.4100027 0.2068854 debye
polarizability: 251.6093964|-39.0948781|204.2958017|-28.629948|-31.101474|212.0564459 unknown
InChI: InChI=1S/C19H20N2O3/c1-19(2,13-7-5-4-6-8-13)20-18(22)12-16-15-11-14(23-3)9-10-17(15)24-21-16/h4-11,20H,12H2,1-3H3
charge 0 multiplicity 1
44 atoms
O  3.746568 0.183271 -2.020501
O  -0.636347 0.232921 1.228907
O  3.616234 -2.616753 2.798418
N  -0.987844 0.330722 -1.082643
N  2.597047 1.106059 -1.849098
C  -2.142589 -0.618392 -1.16335
C  -3.342912 -0.060641 -0.358922
C  -1.683258 -2.020707 -0.688014
C  -2.540475 -0.685683 -2.665259
C  -0.32377 0.663925 0.078159
C  0.88707 1.60592 -0.135869
C  -4.19011 -0.89809 0.406285
C  -3.663021 1.318879 -0.448186
C  2.087636 0.840416 -0.625843
C  2.810972 -0.213547 0.054928
C  3.835517 -0.587477 -0.847353
C  -5.324662 -0.371927 1.06592
C  -4.792511 1.848691 0.209846
C  2.670644 -0.858723 1.310735
C  -5.633274 1.002725 0.97008
C  4.776273 -1.594986 -0.557317
C  3.606474 -1.871668 1.610446
C  4.64474 -2.229134 0.689112
C  2.573893 -2.314719 3.785028
H  -0.602274 0.672695 -1.966981
H  -0.789749 -2.326858 -1.260299
H  -1.42783 -2.004608 0.383597
H  -2.470412 -2.774562 -0.863767
H  -1.705169 -1.078607 -3.275711
H  -2.830597 0.310085 -3.047133
H  -3.405605 -1.357239 -2.792119
H  0.647559 2.407998 -0.856474
H  1.104145 2.067375 0.842243
H  -3.964788 -1.963837 0.509828
H  -3.009956 1.987072 -1.022327
H  -5.963033 -1.036503 1.659362
H  -5.015852 2.919006 0.133487
H  1.855329 -0.583001 1.984543
H  -6.510639 1.410808 1.484214
H  5.564885 -1.870852 -1.261394
H  5.335704 -3.022857 0.988437
H  1.563689 -2.490444 3.367634
H  2.64945 -1.26833 4.139068
H  2.759351 -3.005423 4.620183
