program: Gaussian 09
title: 000012693
version: EM64L-G09RevD.01
frameworkgroup: C1[X(C4H5ClO)]
method: RPBEPBE
basis: SDD
operation: Freq
keyword: #p
keyword: freq=noraman
keyword: PBEPBE/SDD
title: #p freq=noraman PBEPBE/SDD
converged: YES YES NO YES
title: Mulliken charges:
elementType: Cl O C C C C H H H H H
charge: -0.018341 -0.183304 0.278113 -0.761875 -0.034471 -0.519506 0.266088 0.242345 0.242352 0.253389 0.235210
chargesum: 0.00000
title: Mulliken charges with hydrogens summed into heavy atoms:
elementType: Cl O C C C C
charge: -0.018341 -0.183304 0.278113 -0.011090 -0.034471 -0.030907
polarizability: 6.24868701e+01 4.06292620e+00 7.15976391e+01 3.27994616e-03 2.82739363e-03 2.75471166e+01
1716.lowfreq: -11.2065 -0.0037 -0.0026 -0.0021 7.6902 11.3844 63.5107 130.7486 222.2718
frequency: 63.4973 130.7249 222.2710 328.0568 341.7179 390.8450 542.0157 598.2602 605.1231 673.4337 793.7146 935.4355 950.4991 1026.5113 1082.1403 1236.7870 1369.3863 1398.8628 1453.2463 1461.7440 1609.7773 1612.4249 2992.8882 3081.4596 3120.7907 3129.6689 3228.7673
redmass: 4.4309 1.0511 8.7490 3.9726 3.0533 3.5835 5.3733 4.7197 2.2931 1.1639 2.8017 1.3442 1.8333 1.7504 1.8744 4.0006 1.2329 1.1950 1.0849 1.0490 8.5644 5.1000 1.0368 1.0977 1.0624 1.0996 1.1152
irintensity: 1.3994 0.2572 1.3456 0.9177 0.8061 0.5127 14.4330 29.7863 4.2753 0.2363 14.7885 67.4516 15.0287 8.3444 74.9364 37.0098 43.1034 42.4890 10.2313 21.9172 116.3427 30.7714 3.0086 10.3797 0.5874 7.7585 2.6476
temp: 298.150 k
press: 1.00000 atm
elementType: 17 8 6 6 6 6 1 1 1 1 1
symmnumber: 1
zpe: 205638.4 jmol-1
zpe.correction: 0.078324 hartree
zpe.thermalcorrener: 0.085159 hartree
zpe.thermalcorrenthalpy: 0.086103 hartree
zpe.thermalcorrgfe: 0.046895 hartree
zpe.sumelectzpe: -690.215752 hartree
zpe.sumelectthermal: -690.208916 hartree
zpe.sumelectthermalent: -690.207972 hartree
zpe.sumelectthermalfe: -690.247180 hartree
dipole: 1.8990 4.1291 0.0004
dipole: 4.5448
quadrupole: -39.2109 -43.5796 -42.8971
quadrupole: 1.8230 0.0004 0.0000
quadrupole: 2.6850 -1.6838 -1.0012 1.8230 0.0004 0.0000
hfenergy: -690.2940752 hartree
pointgroup: C01 [X(C4H5Cl1O1)]
dipole: 0.2242804 1.7739569 0.0001597 debye
dipolederiv: -0.437717 -0.3456388 -0.0000494 -0.2708012 -0.3846256 -0.0000381 -0.0000646 -0.000049 -0.0459186 -0.551076 0.1290632 -0.0000139 0.1464284 -0.789791 0.0000624 0.00002 -0.0000719 -0.300151 1.1025217 -0.2306931 0.0000032 -0.2291182 0.8494632 -0.000067 0.0000077 -0.0000054 0.194597 -0.3223982 -0.2137209 0.0000075 -0.203279 -0.1916343 0.0000149 0.0000657 0.0000481 0.0438564 0.1486459 0.6463435 0.000083 0.7012371 0.502203 0.000102 0.0000367 0.0000902 -0.0691588 -0.0716476 -0.0188515 0.0000392 -0.1298629 -0.2665872 -0.0000212 -0.0000084 0.0000318 -0.2928944 -0.0609447 0.0327294 0.0000199 0.0831523 0.0587702 -0.000018 0.0000377 -0.0000099 0.1291931 0.0915548 0.0251401 0.0589266 -0.0015179 0.0416262 -0.0908446 0.019941 -0.0928681 -0.0157588 0.0915147 0.0251826 -0.0589717 -0.0014675 0.0416066 0.0908373 -0.0199954 0.0928601 -0.0156854 -0.0179463 0.0290526 -0.0000231 0.0223191 0.104817 -0.000007 -0.0000086 -0.0000095 0.1898334 0.0274928 -0.0786072 -0.0000214 -0.1170903 0.0341518 -0.0000208 -0.0000317 -0.0000164 0.1820871 unknown
polarizability: 60.9804914|0.7168846|73.1040178|0.0022784|0.0036825|27.5471166 unknown
InChI: InChI=1S/C4H5ClO/c1-3(5)4(2)6/h1H2,2H3
charge 0 multiplicity 1
11 atoms
Cl -1.941934 -1.033787 -0.000185
O  1.012455 -1.470363 -0.000048
C  0.754687 -0.238981 0.000204
C  1.866497 0.808642 0.000076
C  -0.666915 0.265926 0.000045
C  -1.045202 1.569707 0.000072
H  2.834312 0.285521 -0.000117
H  1.806691 1.456443 0.893433
H  1.8064 1.456585 -0.893157
H  -2.097089 1.868243 -0.000029
H  -0.294602 2.366464 0.000207
