program: Gaussian 09
title: 000180914
version: EM64L-G09RevD.01
frameworkgroup: C1[X(C21H22O8)]
method: RPBEPBE
basis: SDD
operation: Freq
keyword: #pfreq=noraman
keyword: PBEPBE/SDD
title: #p freq=noraman PBEPBE/SDD
converged: YES YES NO NO
title: Mulliken charges:
elementType: O O O O O O O O C C C C C C C C C C C C C C C C C C C C C H H H H H H H H H H H H H H H H H H H H H H
charge: -0.245664 -0.288798 -0.248664 -0.296860 -0.311403 -0.279097 -0.284790 -0.274999 0.070817 0.286102 0.124831 0.163289 0.141414 0.243678 -0.415480 0.168708 0.114254 0.030216 0.240505 -0.555441 -0.396851 0.160641 -0.323799 -0.518483 -0.533058 -0.518835 -0.529306 -0.498592 -0.522637 0.249598 0.269131 0.264763 0.260030 0.255335 0.235232 0.221184 0.222791 0.249331 0.225382 0.224415 0.209394 0.291800 0.226807 0.260363 0.227238 0.245520 0.222606 0.229424 0.212240 0.226305 0.269409
chargesum: 0.00000
title: Mulliken charges with hydrogens summed into heavy atoms:
elementType: O O O O O O O O C C C C C C C C C C C C C C C C C C C C C
charge: -0.245664 -0.288798 -0.248664 -0.296860 -0.311403 -0.279097 -0.284790 -0.274999 0.070817 0.286102 0.124831 0.163289 0.141414 0.243678 -0.165882 0.168708 0.114254 0.030216 0.240505 -0.286309 -0.132089 0.160641 -0.063769 0.193269 0.164446 0.206775 0.185102 0.198959 0.185317
polarizability: 4.07848772e+02 4.55934501e+00 2.36266007e+02 -4.84204280e+00 -1.78144919e+01 2.08600909e+02
1716.lowfreq: -5.6766 -4.5923 -2.0519 -0.0009 -0.0002 0.0004 11.5982 15.3052 21.3972
frequency: 11.1295 13.9344 21.3208 33.2010 41.3329 61.0079 69.0924 76.6009 87.9717 92.5557 100.7275 107.6845 122.0687 129.8422 137.1515 142.2163 152.0848 155.0182 164.2174 175.3497 177.2634 194.7017 200.7616 206.0539 209.5814 247.8348 258.3774 262.9192 272.0777 278.6499 305.1310 317.8219 332.4086 351.3742 370.1660 385.9119 400.6157 425.3981 438.6267 455.4238 480.0885 500.9215 524.3421 528.4844 531.8251 558.7131 573.7596 599.1836 610.1988 619.2800 633.1176 684.3147 701.5309 707.6399 723.2175 770.9625 782.8010 789.5628 823.5332 843.6643 850.5042 866.8649 872.3762 876.0239 899.3393 911.5248 949.6313 952.4475 966.3638 978.8302 1014.1836 1042.8889 1062.6939 1106.0934 1107.3135 1110.3177 1111.2406 1111.6540 1113.5789 1115.8985 1123.1575 1150.0937 1151.3196 1153.1132 1155.8952 1156.9052 1163.8309 1172.1238 1189.3645 1197.3090 1233.1107 1251.4867 1259.5524 1298.1512 1312.7501 1357.1626 1363.8963 1383.1850 1385.1102 1406.7332 1422.9051 1430.0831 1433.2437 1434.9184 1440.4759 1447.6336 1449.7316 1450.8456 1457.6376 1457.8818 1459.8717 1462.1763 1465.1397 1467.1014 1475.0980 1479.3653 1483.0633 1486.6626 1495.3069 1543.5243 1563.9268 1570.2689 1594.2853 1600.5047 1638.6987 2964.8286 2973.9149 2975.7592 2977.5900 2978.8789 2992.7624 3055.0345 3074.5972 3078.5602 3086.1142 3091.8389 3100.7329 3118.8744 3119.9083 3126.4635 3127.7459 3129.9801 3131.1823 3162.4517 3183.8123 3183.8845 3185.8984
redmass: 2.3679 5.4189 3.8382 4.1529 3.2262 3.0959 4.2750 3.1644 2.9077 2.3369 2.5327 2.0968 2.1099 3.0326 2.1609 1.7726 1.5359 2.4348 1.1798 2.8029 2.0679 3.4588 2.0606 3.9752 3.4359 4.3428 2.8926 2.4992 4.6600 4.8211 5.5005 6.0548 6.7050 5.2887 6.3184 5.8247 5.4584 5.5623 7.7464 6.9709 6.7404 7.8233 5.9968 6.1515 4.9668 6.2961 7.6795 5.3245 4.6009 4.6763 5.2118 8.2007 5.1678 4.5114 5.9229 5.7059 6.4808 3.3812 1.5030 2.2794 5.2850 5.4199 3.4471 2.5018 7.0147 8.5258 1.6347 3.9950 9.4409 6.7375 5.0366 4.8955 7.2346 1.2423 1.2646 1.2472 1.2808 1.2654 1.4170 2.2981 1.7005 1.3467 1.3631 1.4202 1.3684 1.4481 1.7023 2.4826 1.7516 2.5755 2.4940 2.2406 5.9993 6.1662 6.3894 7.1017 7.4083 3.4065 3.2036 1.6742 1.3223 1.2853 1.3561 1.2374 1.5616 1.3011 1.1654 1.0773 1.0624 1.1501 1.0725 1.4035 1.1932 1.0549 1.0663 1.4297 1.0583 1.0539 1.0758 7.9265 8.3157 7.8958 8.1484 7.9099 8.8468 1.0328 1.0302 1.0348 1.0310 1.0303 1.0306 1.1041 1.1043 1.1036 1.0967 1.1028 1.1018 1.1033 1.1049 1.1056 1.1032 1.1050 1.0999 1.0883 1.0971 1.0916 1.0927
irintensity: 3.9322 0.5855 0.2187 0.4478 3.4374 5.2920 2.2155 0.3613 3.3421 2.6226 8.1678 6.3696 0.8599 0.6761 2.3013 0.2199 0.2943 1.9617 0.7744 1.7686 9.3123 3.9773 0.5115 8.5040 7.2932 7.1007 7.3515 3.1636 8.6317 9.0541 0.3630 3.9750 5.7118 2.6318 3.4044 1.2686 1.6258 5.2092 3.5761 22.6140 2.7135 4.0906 6.7148 4.3559 6.6982 2.1516 2.2841 12.4577 3.0984 6.5757 6.8164 2.2994 2.4869 8.7349 0.3303 41.1374 10.4742 10.8821 42.4233 24.8290 13.5544 8.1604 22.3378 23.3669 32.5541 50.8137 6.6959 54.1317 46.6575 147.1085 91.8872 3.2811 260.4014 19.0350 1.2001 25.5622 2.1312 0.8634 16.7605 89.3828 14.8879 3.7615 4.7982 13.5998 13.5753 17.9226 56.6880 22.1468 117.8463 41.3698 5.9041 24.0182 123.4490 416.0667 15.2470 72.2943 33.0289 49.1109 222.4393 6.9810 9.7399 67.6045 73.2361 12.8635 76.9980 20.2524 36.9374 28.5655 13.6127 21.7385 2.3863 99.3142 42.6027 12.9005 10.3438 2.4345 21.5919 17.9845 65.0528 244.3969 24.5249 60.9411 67.1317 157.5318 329.5031 68.7500 67.6621 105.9329 48.8471 79.9095 82.1389 37.7210 22.2374 24.5892 36.5034 25.0098 39.4502 24.9915 10.9924 24.2855 15.0231 16.5337 16.8498 3.3572 2.7816 1.9073 4.4258
temp: 298.150 k
press: 1.00000 atm
elementType: 8 8 8 8 8 8 8 8 6 6 6 6 6 6 6 6 6 6 6 6 6 6 6 6 6 6 6 6 6 1 1 1 1 1 1 1 1 1 1 1 1 1 1 1 1 1 1 1 1 1 1
symmnumber: 1
zpe: 1022136.8 jmol-1
zpe.correction: 0.389311 hartree
zpe.thermalcorrener: 0.419729 hartree
zpe.thermalcorrenthalpy: 0.420673 hartree
zpe.thermalcorrgfe: 0.324737 hartree
zpe.sumelectzpe: -1412.962227 hartree
zpe.sumelectthermal: -1412.931809 hartree
zpe.sumelectthermalent: -1412.930865 hartree
zpe.sumelectthermalfe: -1413.026801 hartree
dipole: 4.7672 1.3045 -0.7427
dipole: 4.9979
quadrupole: -147.4402 -154.8890 -162.3951
quadrupole: -4.8172 2.9435 8.9331
quadrupole: 7.4679 0.0191 -7.4870 -4.8172 2.9435 8.9331
hfenergy: -1413.351538 hartree
pointgroup: C01 [X(C21H22O8)]
dipole: 1.8915551 -0.2589246 0.4705628 debye
polarizability: 408.0822997|-2.2484578|210.4278683|0.6886827|-19.0450543|234.2055198 unknown
InChI: InChI=1S/C21H22O8/c1-23-13-8-7-12-17(19(13)26-4)11(22)9-15(29-12)18-14(24-2)10-16(25-3)20(27-5)21(18)28-6/h7-10H,1-6H3
charge 0 multiplicity 1
51 atoms
O  -0.486981 -0.156792 1.017465
O  1.966043 1.868921 -0.895072
O  1.302782 -2.545321 0.884739
O  -5.027873 -0.028116 -1.066219
O  4.787903 1.641204 -0.615974
O  5.843114 -0.909764 0.442365
O  -6.056082 0.276221 1.506941
O  -2.515463 0.137677 -2.618772
C  1.654701 -0.375024 -0.041469
C  0.188326 -0.236717 -0.202964
C  -2.673581 -0.042522 -0.173598
C  -1.892914 -0.05528 1.026486
C  2.532195 0.659639 -0.4466
C  2.223392 -1.557506 0.52343
C  -0.495053 -0.166057 -1.389086
C  -1.950272 -0.018439 -1.480297
C  -4.103546 0.032602 -0.020359
C  3.944401 0.548449 -0.287849
C  4.484025 -0.659059 0.228497
C  3.619549 -1.704397 0.63801
C  -2.45696 0.053777 2.312158
C  -4.672199 0.212169 1.275725
C  -3.845593 0.212239 2.425184
C  2.307619 2.265381 -2.282286
C  1.825331 -3.789127 1.457225
C  -4.995603 -1.184148 -1.991301
C  4.703549 2.758668 0.359517
C  6.848784 -0.329089 -0.472437
C  -6.820424 1.315224 0.780576
H  0.054416 -0.216359 -2.331455
H  4.082881 -2.612365 1.02962
H  -1.801154 0.030468 3.185828
H  -4.330556 0.312844 3.400507
H  3.401352 2.346774 -2.407461
H  1.823061 3.242146 -2.428822
H  1.890455 1.53171 -2.997249
H  2.477703 -4.318783 0.73631
H  0.935834 -4.398479 1.672236
H  2.383423 -3.594972 2.393049
H  -6.00266 -1.21164 -2.436143
H  -4.805349 -2.117146 -1.428607
H  -4.223896 -1.016997 -2.758749
H  5.023535 2.417377 1.362011
H  3.671947 3.150642 0.403522
H  5.391996 3.531319 -0.016403
H  7.01214 0.73926 -0.263881
H  6.534128 -0.447012 -1.5250
H  7.762696 -0.912005 -0.278316
H  -6.466188 2.321866 1.076176
H  -7.863504 1.175884 1.103005
H  -6.72383 1.182459 -0.30861
