program: Gaussian 09
title: 000012692
version: EM64L-G09RevD.01
frameworkgroup: C1[X(C2H3BrCl2)]
method: RPBEPBE
basis: SDD
operation: Freq
keyword: #p
keyword: freq=noraman
keyword: PBEPBE/SDD
title: #p freq=noraman PBEPBE/SDD
converged: NO YES NO NO
title: Mulliken charges:
elementType: Br Cl Cl C C H H H
charge: 0.033048 0.054016 0.022431 -0.497748 -0.579644 0.345704 0.316948 0.305245
chargesum: 0.00000
title: Mulliken charges with hydrogens summed into heavy atoms:
elementType: Br Cl Cl C C
charge: 0.033048 0.054016 0.022431 -0.152045 0.042549
polarizability: 7.98588302e+01 1.18267775e+01 5.22635344e+01 -4.87674203e+00 -5.01420594e-01 2.95488849e+01
1716.lowfreq: -7.9157 -0.0044 -0.0035 -0.0034 10.8534 14.9855 91.5129 146.0941 211.8444
frequency: 91.5038 146.0909 211.8438 278.5480 362.6455 598.5270 609.2225 669.4517 892.1910 1064.7128 1131.5910 1185.3227 1237.7632 1284.9570 1430.0561 3070.5082 3143.0246 3163.9384
redmass: 6.5773 6.2900 15.9975 16.7546 3.4340 6.5733 5.2088 5.8969 1.4864 2.8752 1.2690 1.0663 1.1544 1.2058 1.0956 1.0569 1.0927 1.1073
irintensity: 2.5948 4.0927 2.2119 1.6379 9.0784 64.2047 79.2635 39.4007 36.0926 10.3636 3.7114 12.6742 16.8019 8.5909 13.8240 2.9147 1.2664 0.8159
temp: 298.150 k
press: 1.00000 atm
elementType: 35 17 17 6 6 1 1 1
symmnumber: 1
zpe: 123047.3 jmol-1
zpe.correction: 0.046866 hartree
zpe.thermalcorrener: 0.053036 hartree
zpe.thermalcorrenthalpy: 0.053980 hartree
zpe.thermalcorrgfe: 0.014258 hartree
zpe.sumelectzpe: -1011.180392 hartree
zpe.sumelectthermal: -1011.174223 hartree
zpe.sumelectthermalent: -1011.173279 hartree
zpe.sumelectthermalfe: -1011.213001 hartree
dipole: 0.1686 -1.4550 -0.1687
dipole: 1.4744
quadrupole: -58.5778 -53.2083 -51.0423
quadrupole: 0.5778 0.1500 -0.5229
quadrupole: -4.3017 1.0678 3.2339 0.5778 0.1500 -0.5229
hfenergy: -1011.2272586 hartree
pointgroup: C01 [X(C2H3Br1Cl2)]
dipole: -0.040923 0.5665731 -0.1175482 debye
dipolederiv: -0.5348481 -0.0230536 -0.0147965 -0.0583153 -0.0946823 -0.0215919 -0.0540362 -0.0211247 -0.1093457 -0.1704961 0.0277727 0.0048617 0.0118234 -0.6554102 0.0796579 0.0226483 0.1550527 -0.1432821 -0.7423346 -0.2721343 0.002081 -0.1750374 -0.3420404 0.0027953 0.0008044 -0.0454756 -0.1222201 0.8643721 0.2742925 0.0079561 0.047707 1.1330824 -0.1449273 -0.0894233 -0.1284268 0.2575185 0.6573451 0.098321 0.1462276 0.2272835 -0.092131 0.0313896 0.1253428 0.0267563 0.0384027 -0.0064164 -0.0372261 -0.0398964 -0.0002516 -0.0371479 0.0231364 0.0108013 0.0145377 -0.0186957 -0.0206007 -0.0273007 -0.0821392 -0.0333341 0.1169563 -0.0001204 -0.0108352 -0.0083082 -0.0115987 -0.0470213 -0.0406713 -0.0242943 -0.0198754 -0.028627 0.0296605 -0.0053021 0.0069886 0.109221 unknown
polarizability: 80.2685561|11.2406974|51.3412565|6.0017268|-1.108169|30.0614369 unknown
InChI: InChI=1S/C2H3BrCl2/c3-1-2(4)5/h2H,1H2
charge 0 multiplicity 1
8 atoms
Br -2.466765 0.204482 -0.200907
Cl 0.520693 -1.747048 0.223015
Cl 2.098647 0.864358 -0.054481
C  0.44893 0.010266 -0.380052
C  -0.619514 0.820737 0.333868
H  0.337232 -0.032329 -1.470025
H  -0.555605 0.717901 1.426326
H  -0.568119 1.877233 0.030556
