program: Gaussian 09
title: 000181001
version: EM64L-G09RevD.01
frameworkgroup: C1[X(C26H22ClNO4)]
method: RPBEPBE
basis: SDD
operation: Freq
keyword: #p
keyword: freq=noraman
keyword: PBEPBE/SDD
title: #p freq=noraman PBEPBE/SDD
converged: YES YES NO NO
title: Mulliken charges:
elementType: Cl O O O O N C C C C C C C C C C C C C C C C C C C C C C C C C C H H H H H H H H H H H H H H H H H H H H H H
charge: -0.017592 -0.249525 -0.254354 -0.283976 -0.310679 0.013065 0.003308 -0.464222 -0.519921 0.515660 0.276623 -0.427065 -0.391306 -0.357598 -0.377461 -0.201678 0.348007 0.551722 -0.185465 -0.513121 -0.458146 -0.247296 0.351522 -0.193326 -0.391112 -0.684671 0.340095 -0.348518 -0.385775 -0.207733 -0.196654 -0.269134 0.328193 0.276176 0.276996 0.236125 0.244827 0.246538 0.251780 0.286507 0.288131 0.252661 0.212480 0.213183 0.235253 0.264230 0.227202 0.234761 0.211192 0.270362 0.257408 0.267619 0.229638 0.225066
chargesum: 0.00000
title: Mulliken charges with hydrogens summed into heavy atoms:
elementType: Cl O O O O N C C C C C C C C C C C C C C C C C C C C C C C C C C
charge: -0.017592 -0.249525 -0.254354 -0.283976 -0.310679 0.013065 0.003308 -0.136029 0.033251 0.515660 0.276623 -0.190940 -0.146480 -0.111060 -0.125681 0.084828 0.348007 0.551722 -0.185465 -0.224990 -0.205484 0.178367 0.351522 0.041927 -0.126882 -0.011516 0.340095 -0.078157 -0.128366 0.059886 0.032984 -0.044069
polarizability: 3.53081260e+02 4.77824765e+01 3.22632405e+02 2.89979462e+00 2.70268457e+01 2.38843985e+02
1716.lowfreq: -6.5151 0.0009 0.0020 0.0023 3.2791 7.5322 15.4420 18.5182 25.3810
frequency: 15.1889 18.4207 25.3174 30.0128 34.9771 37.4203 48.1479 51.9768 62.7430 64.8535 83.9007 88.9229 102.8484 120.0856 125.2706 140.2264 162.5470 184.8367 197.2352 203.6769 220.3206 229.2274 247.5318 249.4900 283.6847 297.0520 303.1780 321.9703 348.4441 370.6791 376.0699 384.4353 410.0605 412.4627 416.5813 425.1461 455.3374 458.4789 483.1808 501.3473 538.6245 562.8310 564.4325 585.6606 603.8580 611.2612 626.5160 631.4723 633.9791 639.0612 691.2254 697.0694 698.5319 717.5086 728.7963 741.2360 767.8218 778.7207 798.8292 807.9930 821.5178 832.7061 834.2996 836.0769 842.4763 847.1891 877.1651 897.6490 902.4656 909.1633 914.4469 939.7490 948.5712 957.2849 967.5448 972.9983 981.5978 982.1423 986.7947 987.0489 995.8212 996.9482 1006.3758 1021.5098 1035.6271 1056.6206 1078.5691 1087.4076 1090.4708 1112.5345 1114.6228 1121.9398 1136.7653 1137.1269 1141.4523 1166.8812 1175.4068 1178.0820 1182.8586 1198.6675 1213.6872 1222.8815 1238.8120 1263.6095 1267.3459 1283.8059 1293.3647 1304.3738 1311.6539 1332.7856 1334.2281 1361.7968 1373.3414 1381.4237 1393.5532 1400.0091 1419.1933 1431.2098 1441.7514 1447.1708 1461.6483 1472.4759 1476.9696 1479.3695 1488.3109 1508.5941 1582.0268 1592.9322 1595.7621 1604.6653 1605.3138 1614.0591 1626.0177 2204.3575 2959.2283 2996.0200 3018.0267 3020.9634 3093.4852 3104.3746 3107.8593 3128.9982 3131.1638 3137.0314 3138.4947 3140.4108 3152.8980 3154.9908 3156.7644 3161.6488 3163.2678 3167.8271 3173.1018 3175.2422 3181.9800 3219.8661
redmass: 6.6577 4.9625 5.6772 5.2812 7.9435 9.0761 4.6511 3.7399 4.7860 7.2622 8.0713 9.2780 5.1017 4.5289 2.0388 5.2350 6.2526 5.0526 6.5794 4.2977 4.5189 7.4092 6.2364 1.2165 6.6751 6.0140 5.4533 7.3926 4.9990 3.5501 4.3832 4.5326 3.6962 3.5588 3.4793 7.7994 3.7816 4.5170 3.4275 4.5997 3.4578 7.3368 5.4052 6.0596 5.8224 6.4120 6.3928 5.2378 5.9094 6.3912 2.4102 2.5248 3.7588 4.4482 4.1188 3.7305 1.6435 4.7124 1.7438 1.3302 4.1613 2.2580 1.5414 1.6880 1.3639 5.0164 2.4689 1.4867 3.3490 1.4361 1.4590 1.5247 1.7055 3.8498 1.3734 1.3576 2.0953 1.8321 5.8341 5.2034 2.7122 1.5246 2.6558 2.1017 2.8369 1.8500 1.5096 1.6009 1.3459 1.2826 2.0025 1.3746 1.4538 3.0644 2.2720 1.1691 1.1307 1.3626 1.2810 1.7171 1.8334 3.0115 2.4675 1.1397 1.3079 1.5188 2.0523 1.3023 1.3551 1.5248 3.5173 2.1804 2.0939 8.5188 7.4827 1.2775 3.7967 1.2042 2.3473 2.5226 1.0434 2.2280 1.0684 2.5273 1.1494 2.3676 7.2427 6.2518 6.6364 10.2677 6.6883 6.4815 6.4921 12.5944 1.0555 1.0363 1.1075 1.0830 1.0993 1.1011 1.0556 1.0855 1.0893 1.0884 1.0879 1.0899 1.0930 1.0929 1.0931 1.0963 1.0965 1.0946 1.0993 1.0984 1.0918 1.1162
irintensity: 0.3377 0.7194 0.2061 1.2048 0.7190 0.9238 0.3054 0.4467 0.4152 1.1201 1.3471 2.1217 0.6117 0.6630 5.4009 1.4861 2.6822 1.3726 1.4386 1.4079 1.2312 3.7843 2.5902 0.6477 5.1215 1.9965 2.1505 5.2981 10.9364 0.8404 0.4463 2.6430 1.8648 1.8315 1.3614 4.8884 4.8843 7.5415 19.1234 0.9896 36.1604 1.4796 7.4107 0.4449 26.4726 1.6396 4.0672 6.4668 8.7705 11.5391 38.7739 20.3550 4.6005 12.2013 14.8582 1.1937 90.6631 11.0306 83.4076 31.3999 27.8234 51.0780 7.5967 40.3071 17.6439 19.5774 31.0073 8.2191 34.6500 1.2826 5.2169 1.7743 26.2162 42.8949 1.6242 0.5256 16.3027 4.9112 3.3298 3.0443 27.5346 8.6416 3.3522 12.0577 68.0901 80.2755 12.8363 6.4647 14.8120 21.4507 4.9365 12.6631 0.6365 195.8882 54.9664 33.2687 11.4407 11.1879 141.9472 85.1717 108.0575 200.5734 191.1416 0.1144 24.4097 40.3759 135.2787 3.0452 2.0258 11.2896 27.2997 1.4154 13.2615 6.0971 15.4067 36.1460 3.3942 24.5897 14.8527 51.9905 9.5566 143.7433 22.4790 17.3153 33.5126 72.6554 12.0434 37.0294 138.2299 76.9165 70.1620 1.3280 62.2197 0.8885 37.5897 22.9930 31.7836 21.8448 36.4396 34.6633 1.5557 5.3743 10.6096 9.3743 4.1246 2.0390 30.6491 1.0718 9.4967 11.3777 1.5613 7.5114 10.4120 8.3658 0.0161 1.6966
temp: 298.150 k
press: 1.00000 atm
elementType: 17 8 8 8 8 7 6 6 6 6 6 6 6 6 6 6 6 6 6 6 6 6 6 6 6 6 6 6 6 6 6 6 1 1 1 1 1 1 1 1 1 1 1 1 1 1 1 1 1 1 1 1 1 1
symmnumber: 1
zpe: 1079064.1 jmol-1
zpe.correction: 0.410994 hartree
zpe.thermalcorrener: 0.440657 hartree
zpe.thermalcorrenthalpy: 0.441601 hartree
zpe.thermalcorrgfe: 0.346175 hartree
zpe.sumelectzpe: -1817.346644 hartree
zpe.sumelectthermal: -1817.316981 hartree
zpe.sumelectthermalent: -1817.316037 hartree
zpe.sumelectthermalfe: -1817.411463 hartree
dipole: -0.0346 2.3610 -0.4779
dipole: 2.4091
quadrupole: -186.8463 -169.0527 -206.2341
quadrupole: 8.9915 -6.7025 21.3188
quadrupole: 0.5314 18.3250 -18.8564 8.9915 -6.7025 21.3188
hfenergy: -1817.757638 hartree
pointgroup: C01 [X(C26H22Cl1N1O4)]
dipole: 0.3316712 0.886404 -0.0514255 debye
polarizability: 375.6893416|19.7629168|288.4524522|31.0670481|32.2620071|250.4158561 unknown
InChI: InChI=1S/C26H22ClNO4/c1-2-30-20-13-11-19(12-14-20)26(16-24(26)27)25(29)32-23(17-28)18-7-6-10-22(15-18)31-21-8-4-3-5-9-21/h3-15,23-24H,2,16H2,1H3
charge 0 multiplicity 1
54 atoms
Cl -3.574125 3.130778 -2.403521
O  -1.925927 -0.652753 0.675116
O  -4.133176 -0.832129 -0.077726
O  2.324378 3.460793 0.274378
O  2.492259 -3.247241 -1.23428
N  -0.98086 -2.461594 3.405385
C  -2.99153 1.337947 -0.150886
C  -4.023801 1.805308 -1.215114
C  -4.277627 2.145859 0.227382
C  -1.633711 1.973906 -0.029327
C  -3.106491 -0.137545 0.128934
C  -1.250397 2.672881 1.135435
C  -0.68308 1.81523 -1.072298
C  0.053274 3.197746 1.281092
C  0.6167 2.330772 -0.946877
C  -1.914385 -2.148895 0.929454
C  0.993487 3.015244 0.237148
C  -1.0763 -2.818735 -0.145803
C  -1.391824 -2.31105 2.296623
C  0.33365 -2.698689 -0.127253
C  -1.728767 -3.512701 -1.192425
C  2.775187 4.194791 1.476139
C  1.084024 -3.263126 -1.181362
C  -0.959183 -4.094209 -2.225799
C  0.444628 -3.969629 -2.228259
C  4.239728 4.558321 1.248573
C  3.258804 -2.200272 -0.646275
C  2.849579 -0.846944 -0.654547
C  4.521944 -2.581499 -0.145425
C  3.724723 0.135572 -0.137379
C  5.388683 -1.589072 0.36194
C  4.993218 -0.230448 0.370632
H  -4.624915 1.033924 -1.700047
H  -4.103111 3.176888 0.546359
H  -5.087435 1.612828 0.733996
H  -1.970976 2.798281 1.952112
H  -0.967637 1.287682 -1.989311
H  0.32158 3.724783 2.200951
H  1.353571 2.22413 -1.749466
H  -2.963331 -2.500564 0.883782
H  0.832946 -2.173866 0.693502
H  -2.821417 -3.589964 -1.202157
H  2.653588 3.548516 2.369384
H  2.149289 5.101345 1.605441
H  -1.454325 -4.640246 -3.035285
H  1.059347 -4.40753 -3.020191
H  4.851793 3.649428 1.115117
H  4.350325 5.186779 0.348679
H  4.630961 5.117549 2.117702
H  1.874783 -0.555665 -1.057835
H  4.804979 -3.638122 -0.164917
H  3.412408 1.186036 -0.136667
H  6.370461 -1.879542 0.751681
H  5.668534 0.536114 0.766091
