program: Gaussian 09
title: 000180861
version: EM64L-G09RevD.01
frameworkgroup: C1[X(C18H14ClF5N2O3S)]
method: RPBEPBE
basis: SDD
operation: Freq
keyword: #p
keyword: freq=noraman
keyword: PBEPBE/SDD
title: #p freq=noraman PBEPBE/SDD
converged: YES YES NO NO
title: Mulliken charges:
elementType: Cl S F F F F F O O O N N C C C C C C C C C C C C C C C C C C H H H H H H H H H H H H H H
charge: 0.024599 0.625530 -0.134937 -0.144392 -0.155847 -0.198454 -0.158360 -0.597794 -0.257704 -0.264682 -0.493965 -0.454775 0.418498 0.128337 -0.478845 0.357395 -0.171547 -0.358977 -0.831289 -0.857599 0.220928 -0.251749 0.237049 -0.076889 0.209283 0.281264 0.266524 -0.370371 -0.376704 -0.142080 0.298764 0.311015 0.241844 0.254993 0.235011 0.261470 0.249642 0.248425 0.409063 0.324675 0.376128 0.272547 0.271654 0.252321
chargesum: 0.00000
title: Mulliken charges with hydrogens summed into heavy atoms:
elementType: Cl S F F F F F O O O N N C C C C C C C C C C C C C C C C C C
charge: 0.024599 0.625530 -0.134937 -0.144392 -0.155847 -0.198454 -0.158360 -0.597794 -0.257704 -0.264682 -0.084903 -0.078646 0.418498 0.128337 -0.478845 0.357395 0.127217 -0.047962 -0.099441 -0.098062 0.220928 0.072925 0.237049 -0.076889 0.209283 0.281264 0.266524 -0.097824 -0.105050 0.110241
polarizability: 4.64064043e+02 2.79900017e+00 2.45891726e+02 5.56130575e+00 -3.97769116e+00 1.61669733e+02
1716.lowfreq: -6.1860 -3.2154 -0.0019 -0.0005 0.0010 2.3969 10.5402 13.5693 17.3653
frequency: 10.0916 13.4764 17.2984 28.2532 35.4136 43.5573 50.2849 60.4585 76.8593 93.1130 99.5806 114.1830 129.6887 133.0789 140.2116 153.5978 160.5755 183.3679 191.1124 193.3495 204.2044 216.5633 228.6014 233.2201 247.3905 261.3410 276.7736 286.4884 295.6817 327.1177 328.0164 346.3219 362.4667 378.1379 393.2500 403.0269 416.7849 432.2603 475.1240 485.8534 500.5390 502.8642 511.7307 528.4749 532.6711 563.5765 575.5493 585.1649 601.0910 623.3435 662.4075 669.7055 673.2953 720.9469 723.5893 743.6930 760.1703 761.1872 787.1751 805.2571 807.3693 810.4352 835.0822 864.6200 871.1943 884.8138 891.3166 895.8063 946.1541 970.0391 971.5630 972.7143 995.4805 1000.2291 1018.4897 1043.1936 1047.2804 1052.4141 1082.5541 1115.2712 1143.6081 1162.7415 1168.1487 1185.6121 1191.8754 1209.1976 1214.3476 1219.0057 1233.8478 1258.9447 1297.3429 1311.8300 1373.6056 1375.7198 1401.6804 1405.4967 1424.9338 1434.5998 1437.1991 1439.2712 1459.2983 1464.6400 1470.9443 1491.6726 1503.7721 1542.6366 1573.7190 1585.5555 1588.8462 1619.5745 1624.4514 1676.6502 2973.8592 2987.8985 3041.4602 3068.6352 3089.5040 3104.9661 3121.7552 3133.2972 3164.7970 3184.6236 3194.7441 3195.6045 3230.7653 3519.4005
redmass: 9.7312 11.5949 13.9061 9.3211 6.7266 8.1764 6.7179 8.7631 6.5259 10.0448 6.6402 3.9348 10.4453 6.6471 1.7630 13.8576 2.4865 1.3777 2.9045 9.2342 9.3736 10.1187 4.8471 11.3112 8.3449 4.4343 5.7224 8.7406 7.3887 15.0259 14.6248 8.3713 2.5759 9.5176 10.9163 10.3046 9.0738 10.3389 5.5694 4.7488 5.9570 5.9503 3.5792 5.4880 12.9393 6.9518 5.3682 5.9098 4.0947 5.1587 2.2117 11.2686 3.4065 6.9732 7.9937 2.3145 3.1111 2.4151 5.4996 2.7372 4.9733 9.9844 5.7768 4.5710 1.3719 1.3980 4.0262 1.2400 4.7971 3.0137 1.4960 6.6378 1.4729 1.3288 1.4298 9.3529 1.6508 2.4595 2.1578 2.4687 3.0309 6.3546 1.1273 2.1996 2.0224 2.1683 2.8277 1.1779 4.0412 2.8929 2.9125 1.2775 6.1430 10.8008 1.3189 1.2931 3.0532 2.2825 2.7396 2.6644 2.3773 1.1202 1.2205 1.1378 1.1169 3.0457 4.4304 6.7038 6.1584 3.9717 4.2957 4.0019 1.0421 1.0381 1.0974 1.0980 1.0978 1.0870 1.0931 1.0907 1.0884 1.0932 1.0998 1.0945 1.0819 1.0779
irintensity: 0.1026 0.4263 0.4029 1.0838 0.1332 1.1968 2.2469 0.3350 1.6940 1.9867 0.5218 0.3753 6.0228 0.7417 1.5810 2.2839 5.5612 0.7690 6.0369 5.9680 1.1437 12.1769 0.1517 3.7467 17.4098 5.1762 1.3588 16.3381 6.1620 0.9259 2.4947 17.3986 1.1229 14.8275 7.2327 6.6090 8.6853 10.0254 3.3808 15.5497 0.1200 9.4011 2.6693 14.6568 0.9453 0.1374 0.2418 43.6651 12.7044 17.4637 31.7734 161.4593 2.4658 15.3288 0.3683 80.1583 2.4256 5.3296 9.1650 69.4035 11.9405 60.1899 16.8070 7.1857 37.3198 0.1680 9.8132 81.0858 50.9681 37.4068 9.5929 79.1702 28.0036 4.4658 6.2641 139.5532 1.7468 9.1447 7.7090 14.9787 4.9995 158.4270 1.4594 155.5451 129.3630 31.2315 4.4318 5.1433 6.3386 346.4917 43.0728 1.9168 64.0792 1.9876 4.2441 24.3520 107.8079 1.1259 74.7321 55.8332 407.2162 39.1514 53.3095 73.2016 87.5982 741.2654 90.5211 129.8405 37.4380 208.4247 7.7436 304.8161 14.3507 13.6572 10.8447 10.1020 21.8388 2.1404 14.7780 10.7405 4.0863 0.2256 1.4923 5.2732 380.2811 72.0853
temp: 298.150 k
press: 1.00000 atm
elementType: 17 16 9 9 9 9 9 8 8 8 7 7 6 6 6 6 6 6 6 6 6 6 6 6 6 6 6 6 6 6 1 1 1 1 1 1 1 1 1 1 1 1 1 1
symmnumber: 1
zpe: 771212.8 jmol-1
zpe.correction: 0.293739 hartree
zpe.thermalcorrener: 0.323564 hartree
zpe.thermalcorrenthalpy: 0.324509 hartree
zpe.thermalcorrgfe: 0.228157 hartree
zpe.sumelectzpe: -2384.591561 hartree
zpe.sumelectthermal: -2384.561736 hartree
zpe.sumelectthermalent: -2384.560792 hartree
zpe.sumelectthermalfe: -2384.657143 hartree
dipole: 10.9110 2.9655 -0.1623
dipole: 11.3079
quadrupole: -142.3098 -195.3531 -186.8935
quadrupole: -4.9199 7.4380 -6.3809
quadrupole: 32.5423 -20.5009 -12.0414 -4.9199 7.4380 -6.3809
hfenergy: -2384.8853001 hartree
pointgroup: C01 [X(C18H14Cl1F5N2O3S1)]
dipole: -4.2323266 -0.91493 1.0212246 debye
polarizability: 462.3891395|22.4538548|179.5857465|-0.3743398|-33.6277789|229.6506152 unknown
InChI: InChI=1S/C18H14ClF5N2O3S/c1-8-9(2)13(30(29)18(23,24)16(19)22)7-6-12(8)25-17(28)26-15(27)14-10(20)4-3-5-11(14)21/h3-7,16,25-26H,1-2H3
charge 0 multiplicity 1
44 atoms
Cl 7.595154 2.637806 1.130315
S  5.264525 -0.756696 -1.070807
F  4.742465 1.583797 0.501326
F  5.840834 -0.062168 1.642187
F  8.081694 0.254079 -0.02386
F  -5.486703 0.031452 -2.260398
F  -4.940347 -0.896266 2.479407
O  5.578905 0.161882 -2.426906
O  -1.363387 1.241111 -2.304738
O  -2.915765 -1.312446 0.673747
N  -0.791596 -0.351349 -0.635341
N  -3.044944 0.292913 -1.016197
C  2.709179 -1.423373 0.108046
C  1.290816 -1.302865 0.170456
C  3.387494 -0.639121 -0.857956
C  0.62155 -0.422621 -0.743869
C  2.739664 0.218962 -1.759256
C  1.342134 0.331243 -1.70798
C  3.457771 -2.352507 1.052324
C  0.474404 -2.081033 1.190469
C  5.763423 0.620334 0.411251
C  7.074585 1.269202 -0.019948
C  -1.650437 0.434835 -1.378509
C  -5.111951 -0.470823 0.09064
C  -3.616298 -0.538648 -0.05721
C  -6.016171 -0.235404 -0.977112
C  -5.733572 -0.709089 1.347993
C  -7.411306 -0.254835 -0.855537
C  -7.126117 -0.734544 1.530253
C  -7.965254 -0.512129 0.417787
H  3.338764 0.771178 -2.492936
H  0.803848 0.988691 -2.392029
H  3.050165 -3.378351 1.013496
H  3.386295 -2.003353 2.098816
H  4.531322 -2.420636 0.811067
H  1.110845 -2.674686 1.861194
H  -0.127793 -1.407644 1.830812
H  -0.233225 -2.781419 0.704924
H  -1.269406 -0.944079 0.071333
H  6.979488 1.690151 -1.033166
H  -3.652832 0.856252 -1.618875
H  -8.03368 -0.07421 -1.735242
H  -7.529025 -0.920067 2.529016
H  -9.051513 -0.533225 0.54291
