program: Gaussian 09
title: 000180867
version: EM64L-G09RevD.01
frameworkgroup: C1[X(C19H29ClO4)]
method: RPBEPBE
basis: SDD
operation: Freq
keyword: #p
keyword: freq=noraman
keyword: PBEPBE/SDD
title: #p freq=noraman PBEPBE/SDD
converged: YES YES NO NO
title: Mulliken charges:
elementType: Cl O O O O C C C C C C C C C C C C C C C C C C C H H H H H H H H H H H H H H H H H H H H H H H H H H H H H
charge: -0.046859 -0.283418 -0.255556 -0.267134 -0.234815 0.173174 -0.414403 -0.386568 0.519931 -0.788042 -0.720856 -0.345831 -0.360193 -0.387414 -0.411919 -0.356396 -0.360400 0.430240 -0.697100 -0.332445 -0.247727 -0.371327 0.262183 -0.503512 0.196450 0.194234 0.213941 0.198002 0.219984 0.216888 0.226357 0.218015 0.225483 0.209743 0.184226 0.188829 0.193100 0.199675 0.253945 0.251692 0.244557 0.208432 0.211251 0.215450 0.232943 0.233053 0.250516 0.190426 0.264685 0.219007 0.242239 0.246301 0.236961
chargesum: 0.00000
title: Mulliken charges with hydrogens summed into heavy atoms:
elementType: Cl O O O O C C C C C C C C C C C C C C C C C C C
charge: -0.046859 -0.283418 -0.255556 -0.267134 -0.234815 0.173174 -0.023718 0.025376 0.519931 -0.124813 -0.067615 0.027225 0.032583 -0.133469 -0.160227 -0.356396 -0.115843 0.430240 -0.061968 0.133550 0.193216 0.112365 0.262183 0.221989
polarizability: 2.74138336e+02 1.85439751e+01 2.33422617e+02 1.42738030e+01 -8.90566786e+00 1.86107541e+02
1716.lowfreq: -14.0749 -6.1127 -3.8049 0.0015 0.0017 0.0018 4.0905 6.9962 13.3678
frequency: -5.8131 3.7186 13.1070 19.9912 26.3656 30.0829 40.3973 51.2237 78.0078 89.5978 91.5019 105.0401 116.6602 121.8565 145.5236 148.8762 162.1001 168.1285 185.9466 203.4223 220.9754 230.9083 234.4217 236.7276 248.8300 266.9789 291.1052 306.5386 313.0195 323.3619 325.8478 362.2155 382.4912 400.4767 439.2102 449.7314 467.3376 482.1862 500.7315 517.0345 520.9045 546.5459 629.3911 644.2070 660.6966 681.4064 722.0202 728.6288 749.6016 791.6850 825.1682 826.8606 831.5394 842.1201 864.7929 883.1637 886.3257 899.5056 920.3171 937.0427 944.5554 950.3825 958.3300 963.9005 994.3577 1002.0821 1018.6135 1025.2101 1060.1333 1070.4213 1075.1097 1076.9051 1088.6131 1099.6345 1113.4092 1118.4429 1123.4418 1143.0437 1145.8111 1148.3474 1163.3963 1190.5553 1195.9237 1205.4518 1221.2828 1232.0633 1238.7550 1249.4261 1255.5848 1270.8123 1279.3879 1287.4166 1304.9498 1306.6515 1322.1913 1342.4938 1343.9761 1346.4193 1353.0335 1376.6469 1386.6147 1390.5681 1393.0270 1399.3143 1422.3405 1430.8962 1454.0046 1457.6913 1460.9579 1462.6098 1464.3593 1468.1783 1469.5883 1472.9711 1478.4337 1480.0455 1480.7717 1483.9807 1486.9038 1493.3087 1496.5651 1554.6234 1604.7282 1657.9246 2941.9649 2951.0094 2955.2144 2959.4293 2966.1248 2972.1489 2972.6424 2973.9584 2979.4685 2990.8110 3004.3639 3006.5393 3020.7702 3032.6003 3042.6100 3042.7804 3067.9257 3068.9131 3071.0982 3072.5484 3077.0903 3077.2562 3079.8727 3109.3036 3116.9624 3147.5912 3152.4234 3152.8251 3171.1319
redmass: 2.4153 4.1442 4.1536 4.8189 6.2783 3.0572 5.4673 3.9916 2.8586 1.1320 2.7336 2.7495 2.8943 2.0034 4.3755 4.2364 4.5084 3.0634 3.2800 3.7871 3.7175 2.4409 1.2848 1.1530 3.3998 4.0191 3.9783 1.5332 2.2628 3.4757 3.3012 3.2340 3.4705 3.3668 3.5076 3.7074 3.7430 4.1441 3.6570 3.4064 3.7237 3.6876 3.3119 4.8434 5.8624 6.2466 1.1214 2.9029 1.1875 3.7702 1.2739 1.4210 4.2962 1.4923 2.2725 1.4966 5.5207 1.8465 1.7293 1.4543 6.0595 4.0303 1.5645 1.4024 1.5534 2.3542 2.4414 3.4069 2.1241 1.6535 2.2922 4.4012 4.4376 2.0183 1.2654 1.9500 1.7908 3.5078 1.6906 1.4857 2.5747 1.2174 1.7336 2.4761 2.3114 1.1372 1.6780 1.4472 1.4032 1.1453 1.3554 1.0620 1.3435 1.3652 1.2541 3.3192 1.4922 1.4923 1.6291 1.3227 1.3728 1.2188 2.3902 1.3752 1.1679 1.0914 1.0498 1.0732 1.4304 1.0761 1.0506 1.0680 1.0661 1.0658 1.0476 1.2109 1.3263 1.1061 1.0872 1.0868 1.0602 7.2223 7.0028 9.3448 1.0676 1.0587 1.0618 1.0587 1.0588 1.0390 1.0405 1.0503 1.0367 1.0973 1.0996 1.0295 1.1032 1.0592 1.1040 1.1008 1.1000 1.1006 1.0993 1.0992 1.0921 1.0996 1.0989 1.1048 1.1077 1.0880 1.0910 1.1049 1.0955
irintensity: 0.1402 0.2025 0.2720 0.2268 0.7330 0.2858 0.8527 0.2744 0.0951 0.2837 0.0226 0.1482 1.5619 0.4500 2.9617 1.6909 1.7968 3.6479 1.4799 0.4915 16.8800 1.4053 0.1247 0.4511 2.6893 4.6527 13.4684 2.0331 2.7680 0.8201 3.4068 0.9130 1.8677 3.2810 6.9580 6.1777 0.5679 5.6519 4.5795 1.0969 4.1033 5.8119 12.9763 1.6831 14.9182 28.4117 7.6581 5.1882 0.4139 9.4006 7.4438 17.1114 4.2402 21.6233 13.1189 10.8029 10.9854 11.0393 4.0580 2.9609 8.6355 73.7903 13.8161 3.1439 1.0016 4.8201 0.9927 50.9717 2.9970 3.6619 9.2895 188.8245 182.5400 12.8772 0.3081 17.3561 52.0917 119.6248 20.6711 0.4576 5.6380 1.4452 3.5543 3.2059 105.4573 8.8954 34.9176 10.4938 3.0495 0.1424 9.1549 0.4756 1.5321 33.0799 0.9426 3.0790 12.2178 3.4574 0.2091 15.3761 4.1389 12.5401 8.2852 23.5038 20.7180 13.9264 15.1584 0.7557 50.5999 0.7092 13.7089 2.6831 2.1613 2.3986 14.9360 28.4720 53.0471 28.5060 15.3668 7.1710 23.1568 6.7195 3.9698 186.9137 44.3570 6.7794 41.8557 19.7929 15.0857 51.3413 3.6055 107.0521 28.9441 2.0990 8.2719 29.0188 0.4843 27.2260 102.7684 9.6263 4.5928 74.2770 53.5507 94.0311 11.3367 39.2404 43.6795 25.4599 28.9438 7.9248 4.3069 15.9732 8.5979
temp: 298.150 k
press: 1.00000 atm
elementType: 17 8 8 8 8 6 6 6 6 6 6 6 6 6 6 6 6 6 6 6 6 6 6 6 1 1 1 1 1 1 1 1 1 1 1 1 1 1 1 1 1 1 1 1 1 1 1 1 1 1 1 1 1
symmnumber: 1
zpe: 1162342.8 jmol-1
zpe.correction: 0.442713 hartree
zpe.thermalcorrener: 0.470224 hartree
zpe.thermalcorrenthalpy: 0.471168 hartree
zpe.thermalcorrgfe: 0.378812 hartree
zpe.sumelectzpe: -1500.457221 hartree
zpe.sumelectthermal: -1500.429710 hartree
zpe.sumelectthermalent: -1500.428766 hartree
zpe.sumelectthermalfe: -1500.521122 hartree
dipole: -1.9028 3.5675 -1.3919
dipole: 4.2761
quadrupole: -122.7427 -151.5549 -151.7173
quadrupole: -4.0945 8.9215 -1.0407
quadrupole: 19.2622 -9.5499 -9.7123 -4.0945 8.9215 -1.0407
hfenergy: -1500.8999336 hartree
pointgroup: C01 [X(C19H29Cl1O4)]
dipole: 0.1995244 -1.4415992 0.8439331 debye
polarizability: 271.9736173|-18.9455892|218.2724997|-24.2252431|-17.9308861|203.4223763 unknown
InChI: InChI=1S/C19H29ClO4/c1-5-6-7-10-19(2,3)15-8-9-17(16(20)13-15)24-12-11-23-14-18(21)22-4/h8-9,13H,5-7,10-12,14H2,1-4H3
charge 0 multiplicity 1
53 atoms
Cl 0.873612 3.319071 -1.434062
O  1.596026 0.434632 -2.398383
O  4.966686 -0.161008 -0.941701
O  6.524875 -2.862846 1.007957
O  4.438424 -1.874626 1.348121
C  -2.775087 0.703632 1.453348
C  -3.889292 1.674644 0.929279
C  -4.574559 1.268748 -0.394799
C  -1.616676 0.610522 0.432501
C  -3.397975 -0.683527 1.757802
C  -2.215166 1.281026 2.790275
C  -5.584135 2.331024 -0.887013
C  -6.302503 1.927415 -2.194832
C  -0.954353 1.798089 0.016539
C  -1.161883 -0.615932 -0.114616
C  0.111668 1.747648 -0.895453
C  -0.081449 -0.660606 -1.021375
C  0.582585 0.519315 -1.423931
C  -7.307786 2.992428 -2.684023
C  2.981925 0.724495 -1.947902
C  3.605164 -0.547461 -1.359991
C  5.836248 -1.273417 -0.632827
C  5.481478 -1.997828 0.672892
C  6.3318 -3.662236 2.244566
H  -4.657717 1.766299 1.725319
H  -3.455923 2.688471 0.806575
H  -3.805773 1.106103 -1.176701
H  -5.104611 0.303454 -0.267109
H  -4.244518 -0.560773 2.45808
H  -2.664639 -1.358978 2.235853
H  -3.7834 -1.180934 0.8504
H  -1.791243 2.29191 2.650566
H  -1.41688 0.633108 3.195965
H  -3.022071 1.352246 3.543833
H  -6.341727 2.516617 -0.096208
H  -5.056048 3.295151 -1.043348
H  -6.829472 0.963909 -2.037735
H  -5.544794 1.741874 -2.983159
H  -1.274979 2.774336 0.393139
H  -1.644035 -1.555445 0.167841
H  0.264875 -1.609883 -1.443166
H  -8.091711 3.175727 -1.924777
H  -6.800115 3.955792 -2.880029
H  -7.80874 2.678714 -3.618356
H  3.52092 1.046079 -2.852444
H  2.997884 1.541363 -1.205167
H  3.027894 -0.909557 -0.488839
H  3.651326 -1.346329 -2.131411
H  6.853786 -0.858439 -0.540069
H  5.849392 -2.029415 -1.449647
H  5.432791 -4.294656 2.153445
H  6.21929 -2.993654 3.114176
H  7.24101 -4.273193 2.3277
