program: Gaussian 09
title: 000180854
version: EM64L-G09RevD.01
frameworkgroup: C1[X(C18H14ClF5N2O4S)]
method: RPBEPBE
basis: SDD
operation: Freq
keyword: #p
keyword: freq=noraman
keyword: PBEPBE/SDD
title: #p freq=noraman PBEPBE/SDD
converged: YES YES NO NO
title: Mulliken charges:
elementType: Cl S F F F F F O O O O N N C C C C C C C C C C C C C C C C C C H H H H H H H H H H H H H H
charge: 0.071241 0.851420 -0.109746 -0.148174 -0.151656 -0.153343 -0.222295 -0.532555 -0.503846 -0.198380 -0.153814 -0.498076 -0.500563 -0.285585 0.527026 0.241024 -0.400966 0.289820 0.348244 -0.520715 -0.835608 -0.253496 -0.841582 0.289362 0.219984 -0.091261 0.259688 0.288446 -0.379160 -0.373735 -0.145729 0.302470 0.317742 0.250994 0.241510 0.282974 0.323031 0.262664 0.235096 0.232934 0.333685 0.338829 0.271668 0.269011 0.251420
chargesum: 0.00000
title: Mulliken charges with hydrogens summed into heavy atoms:
elementType: Cl S F F F F F O O O O N N C C C C C C C C C C C C C C C C C C
charge: 0.071241 0.851420 -0.109746 -0.148174 -0.151656 -0.153343 -0.222295 -0.532555 -0.503846 -0.198380 -0.153814 -0.164391 -0.161734 -0.285585 0.527026 0.241024 -0.098496 0.289820 0.348244 -0.202973 -0.060130 0.069536 -0.110889 0.289362 0.219984 -0.091261 0.259688 0.288446 -0.107491 -0.104724 0.105691
polarizability: 4.54005606e+02 2.97694788e-01 2.62116152e+02 -2.18096904e+01 5.36075954e+00 1.56092621e+02
1716.lowfreq: -3.2206 -1.9843 -0.0013 -0.0005 0.0007 3.3161 11.8788 13.3935 18.7390
frequency: 11.6094 13.3587 18.7202 27.0114 32.9561 33.9816 47.4610 57.6028 67.6557 72.8523 88.3810 100.2193 114.5204 119.9930 138.9112 148.7042 154.5627 170.2409 177.3156 184.2461 197.6740 208.1517 224.0741 229.2498 231.1794 241.1415 249.5413 260.8100 267.4631 281.7464 293.0926 314.2422 334.8988 337.7932 353.0823 367.5921 381.3196 387.4328 424.1264 446.0442 457.9152 474.6166 476.7531 489.9841 500.0184 504.6318 522.8072 558.8633 570.6107 573.8744 602.3243 620.1624 633.7574 660.0457 680.5229 708.4691 720.7354 732.1480 738.5578 744.3100 750.8074 759.3924 796.1671 802.3816 814.0805 840.8463 876.6300 882.8231 905.1573 927.5974 932.3030 935.0819 945.8151 952.0807 969.2015 972.3840 1002.6276 1022.1584 1033.2465 1045.5641 1050.5206 1057.9518 1091.2062 1147.1102 1161.0553 1167.9860 1173.8654 1197.1438 1205.7694 1229.2104 1233.5144 1236.5790 1271.3616 1286.3256 1298.5327 1363.4854 1375.1718 1395.7863 1405.9169 1410.8947 1433.5279 1447.7935 1452.5607 1455.3169 1466.8947 1477.1148 1482.2865 1488.9753 1519.9475 1566.4934 1573.2073 1619.8159 1620.8013 1638.6468 1683.9057 2958.6231 2994.7465 3028.5533 3079.6771 3097.2165 3109.3459 3111.7365 3144.5497 3164.7163 3182.6169 3183.8897 3194.3820 3505.6978 3527.3108
redmass: 9.0569 9.4571 11.9206 9.7440 10.2681 5.6879 11.8279 9.2559 5.1981 5.4391 3.4343 3.5356 7.5842 2.5304 11.4022 3.3846 10.9821 2.4993 5.7513 14.9439 1.5107 8.2558 8.7374 4.8128 6.4286 9.0730 4.9049 13.3797 5.4910 4.7005 7.6255 9.0390 10.4860 7.6985 7.4059 8.6635 14.7249 9.4517 8.0202 5.6673 3.5596 5.8285 5.1565 5.7159 8.8023 7.4773 5.6912 5.3139 1.7875 2.9301 5.0059 1.9333 1.8256 4.7909 6.5191 6.0964 5.4097 7.6033 3.9260 7.3539 6.5509 2.3544 10.2077 2.6232 6.1940 7.6504 7.8407 1.3993 1.3289 1.4091 7.7219 8.0446 2.9538 8.8604 1.3825 6.2144 1.8081 4.2419 1.7287 1.5311 2.7138 1.5374 2.5678 3.6338 2.5960 1.2026 7.5736 2.0184 2.4974 6.9718 2.5390 1.1437 1.3691 2.8131 1.2664 4.1548 10.9748 1.6804 2.0065 1.5055 2.7673 2.7743 1.6473 1.9591 1.0522 1.4120 1.0547 1.2019 2.2122 4.6408 7.0081 6.1479 8.4061 4.8742 6.9992 1.0405 1.0386 1.0981 1.0948 1.0947 1.0872 1.1007 1.0919 1.0883 1.0924 1.0932 1.0999 1.0777 1.0761
irintensity: 0.1448 0.9506 0.4533 1.0188 2.0100 1.1399 3.4753 5.9434 4.1022 1.9513 2.5053 0.2315 0.8233 4.0275 2.2316 3.3758 0.9296 3.4819 0.3168 3.7524 4.3556 1.7550 1.7162 0.0783 1.3226 4.1774 2.8955 1.7822 0.0165 2.0756 1.5572 1.7818 26.7442 5.7162 8.0072 23.0973 3.8731 2.1680 10.4641 32.2964 20.5930 80.3599 37.5128 28.3473 9.6302 25.2275 26.9451 2.8726 24.3513 7.8616 15.5144 129.9344 69.5559 8.8921 12.0084 32.1861 26.5030 32.7650 25.4316 56.2190 0.7307 12.2376 120.3875 65.9040 47.7986 46.4115 13.9299 0.5107 7.5678 25.4183 29.8568 114.2494 23.2890 36.0621 2.6498 27.1525 46.5890 82.9308 22.8683 2.5034 5.2515 20.5758 28.7145 289.6526 431.2111 111.8004 125.5182 4.1656 63.6896 262.7177 37.4722 3.3019 54.5878 34.4764 4.2646 9.2799 3.2049 82.9634 204.1648 205.4773 110.0371 63.4172 135.3038 979.8716 22.5662 80.5815 17.6619 7.8377 188.7123 224.5369 23.1071 7.5275 116.0866 74.5399 222.0331 29.0781 9.6399 16.9001 9.2918 10.7148 0.2312 6.9776 10.7456 4.0658 14.1454 0.3895 1.4456 49.1252 32.3559
temp: 298.150 k
press: 1.00000 atm
elementType: 17 16 9 9 9 9 9 8 8 8 8 7 7 6 6 6 6 6 6 6 6 6 6 6 6 6 6 6 6 6 6 1 1 1 1 1 1 1 1 1 1 1 1 1 1
symmnumber: 1
zpe: 777083.1 jmol-1
zpe.correction: 0.295975 hartree
zpe.thermalcorrener: 0.327420 hartree
zpe.thermalcorrenthalpy: 0.328364 hartree
zpe.thermalcorrgfe: 0.228276 hartree
zpe.sumelectzpe: -2459.627296 hartree
zpe.sumelectthermal: -2459.595852 hartree
zpe.sumelectthermalent: -2459.594908 hartree
zpe.sumelectthermalfe: -2459.694995 hartree
dipole: -9.3212 5.4931 3.4308
dipole: 11.3503
quadrupole: -174.6612 -193.0572 -203.8048
quadrupole: -40.4804 -15.2262 -2.1135
quadrupole: 15.8465 -2.5494 -13.2971 -40.4804 -15.2262 -2.1135
hfenergy: -2459.9232716 hartree
pointgroup: C01 [X(C18H14Cl1F5N2O4S1)]
dipole: -3.6777489 -2.3907179 0.8364757 debye
polarizability: 451.7105226|23.6967324|196.0413311|24.1036972|-50.2830981|224.4625249 unknown
InChI: InChI=1S/C18H14ClF5N2O4S/c1-8-7-13(31(29,30)18(23,24)16(19)22)9(2)6-12(8)25-17(28)26-15(27)14-10(20)4-3-5-11(14)21/h3-7,16,25-26H,1-2H3
charge 0 multiplicity 1
45 atoms
Cl 8.459408 -0.501417 0.48508
S  5.048089 0.597065 0.924368
F  5.838161 -2.066946 0.300254
F  4.930327 -0.930864 -1.449676
F  7.618339 -1.166132 -1.984474
F  -6.634224 0.854865 -2.448859
F  -4.794754 -1.465503 1.411439
O  5.68761 1.989009 0.348411
O  5.360919 0.085962 2.436799
O  -1.608329 1.381298 -1.363322
O  -4.48166 1.844955 -1.044718
N  -0.99701 0.094718 0.523672
N  -3.2068 0.051851 -0.219468
C  3.176475 0.488714 0.657159
C  2.519216 1.119931 -0.425462
C  5.842533 -0.846544 -0.371563
C  2.514741 -0.23357 1.667481
C  1.115209 -0.370688 1.634414
C  0.41218 0.248778 0.550117
C  1.10995 0.984484 -0.443087
C  3.209232 1.901357 -1.526291
C  7.207846 -0.367945 -0.867975
C  0.39002 -1.147818 2.718366
C  -1.900057 0.596723 -0.433421
C  -4.413153 0.667572 -0.626177
C  -5.64186 -0.217746 -0.506403
C  -6.741707 -0.046538 -1.392342
C  -5.850476 -1.200646 0.492031
C  -7.944409 -0.76591 -1.2842
C  -7.025468 -1.943871 0.656297
C  -8.085461 -1.713547 -0.248817
H  3.097103 -0.668569 2.486912
H  0.539001 1.465213 -1.23971
H  3.771041 1.223816 -2.195837
H  2.464775 2.43579 -2.137215
H  3.930918 2.627953 -1.118355
H  7.157259 0.688584 -1.171833
H  1.10401 -1.535135 3.462174
H  -0.335753 -0.517035 3.270449
H  -0.156214 -2.021928 2.310187
H  -1.402657 -0.389056 1.327902
H  -3.284943 -0.848916 0.261247
H  -8.742102 -0.578909 -2.007476
H  -7.099821 -2.673583 1.466196
H  -9.017409 -2.276922 -0.148471
