program: Gaussian 09
title: 000180838
version: EM64L-G09RevD.01
frameworkgroup: C1[X(C17H12F6N2O4S)]
method: RPBEPBE
basis: SDD
operation: Freq
keyword: #p
keyword: freq=noraman
keyword: PBEPBE/SDD
title: #p freq=noraman PBEPBE/SDD
converged: YES YES NO NO
title: Mulliken charges:
elementType: S F F F F F F O O O O N N C C C C C C C C C C C C C C C C C H H H H H H H H H H H H
charge: 0.856073 -0.117751 -0.138124 -0.172259 -0.159932 -0.154078 -0.220922 -0.548944 -0.489069 -0.199374 -0.150211 -0.503195 -0.492361 -0.271779 0.531843 0.164364 -0.210300 -0.510500 0.532824 -0.476579 0.125588 -0.822180 0.300335 -0.094270 0.219935 0.259256 0.288598 -0.379039 -0.373658 -0.144821 0.301260 0.319798 0.239395 0.264675 0.256818 0.242244 0.284368 0.313508 0.335802 0.271832 0.269287 0.251547
chargesum: 0.00000
title: Mulliken charges with hydrogens summed into heavy atoms:
elementType: S F F F F F F O O O O N N C C C C C C C C C C C C C C C C C
charge: 0.856073 -0.117751 -0.138124 -0.172259 -0.159932 -0.154078 -0.220922 -0.548944 -0.489069 -0.199374 -0.150211 -0.189687 -0.156560 -0.271779 0.531843 0.164364 0.090960 -0.190703 0.532824 -0.237184 0.390263 -0.038750 0.300335 -0.094270 0.219935 0.259256 0.288598 -0.107208 -0.104371 0.106725
polarizability: 4.21292125e+02 -7.79498121e+00 2.38152791e+02 1.94353797e+01 1.09554913e+01 1.46461663e+02
1716.lowfreq: -4.4630 -2.2119 -0.0022 -0.0018 -0.0015 2.0035 11.9042 12.1565 16.6189
frequency: 11.7658 12.0461 16.5857 27.1253 32.4413 39.3975 51.8526 56.1973 67.0370 75.2677 95.8445 104.8890 115.9994 121.4115 142.5720 151.8339 159.9746 179.4360 196.3960 209.6747 220.8664 227.4342 229.2932 238.8912 248.3702 252.7271 258.4223 300.4137 302.3647 325.3362 326.8496 355.9325 378.3724 388.8463 408.7157 439.3858 453.7861 461.2904 475.1722 483.8470 495.1594 512.1893 534.0596 538.2968 558.4340 560.3487 573.3679 592.7559 598.7357 635.8920 662.1822 682.2492 713.7688 719.8787 740.0303 748.8704 759.0888 765.9224 793.5634 803.4250 827.9599 833.0364 873.9456 883.3472 929.4077 933.3905 938.4467 949.1235 966.9163 969.5471 972.3186 973.0349 981.6014 1013.5029 1023.1886 1047.7732 1052.0894 1055.3427 1097.1661 1152.4803 1156.1616 1167.6834 1172.1091 1185.2002 1204.7402 1228.0877 1233.2922 1258.1371 1285.7896 1288.8461 1322.0890 1375.3565 1381.5746 1399.5461 1415.0785 1433.7161 1449.1262 1453.0620 1463.3410 1468.9054 1485.2506 1511.7243 1573.6779 1583.0132 1609.4377 1620.7056 1642.4563 1685.0779 2995.4638 3077.5619 3104.0938 3112.4854 3130.9844 3160.4577 3164.7593 3184.1466 3185.6055 3194.5288 3507.0411 3520.2025
redmass: 11.8027 9.2212 10.9502 7.4762 10.0082 5.8327 9.5264 8.9900 6.9925 7.2495 3.6476 2.8174 6.5828 2.6389 12.7841 10.1944 6.0343 6.7775 12.6912 5.8853 4.7057 8.9224 4.8070 6.9942 10.2059 12.5936 8.5310 7.3507 7.9320 8.7127 9.4218 10.6913 12.8448 9.9735 8.2611 5.4740 4.2428 4.7629 5.0611 9.3797 6.7673 9.3355 5.6368 12.6494 1.4780 5.6779 5.0909 4.0474 3.6170 1.2574 4.7804 6.5271 5.8167 3.2855 5.9817 8.6746 2.7029 4.7168 12.8989 2.5548 4.0518 1.8331 7.5279 1.3989 1.3979 7.1337 7.1578 3.7754 1.3584 1.4110 6.2661 7.2500 7.3375 6.8962 1.6602 6.2865 2.4730 1.6865 2.5340 2.3843 1.5127 1.1993 4.8607 1.9318 2.4060 5.7365 2.6692 1.8361 1.1465 1.6904 1.3585 10.9104 5.5300 3.1707 1.3388 2.7949 3.2042 2.2126 1.7703 1.0494 1.2394 2.1486 7.1091 5.4358 5.7072 8.4907 4.5722 7.1185 1.0385 1.0954 1.0877 1.1004 1.0899 1.0953 1.0883 1.0932 1.0927 1.0999 1.0777 1.0765
irintensity: 0.4023 0.0666 0.2365 0.5137 3.8443 0.6172 0.6348 7.3335 6.3026 3.2016 0.9963 2.3293 3.3610 2.0978 2.2386 0.3479 6.7512 1.3918 3.3528 2.3322 1.4121 4.2581 0.0480 2.9491 4.8213 4.0880 0.3221 2.6330 3.0717 6.4187 17.8406 20.6285 1.0681 0.4162 12.2766 78.7370 15.3343 82.4298 1.8429 10.7597 4.5451 51.0445 22.3908 2.2104 19.8986 11.9820 13.6677 6.4861 47.8782 160.3242 6.9302 13.2540 53.6481 4.3400 5.6205 65.4340 10.8351 0.7940 122.4216 78.8553 13.7538 85.0136 15.2501 0.4246 27.7662 30.0926 97.6672 52.3201 0.5846 4.2561 39.8598 35.6142 21.4613 73.9154 9.6851 105.9111 4.8028 43.1205 25.6656 775.7546 4.7197 82.7266 112.5182 59.7566 62.0385 304.0116 21.4648 25.5642 2.2194 0.7168 14.5556 4.8970 106.5829 222.0173 122.5316 88.1130 39.1623 267.0855 1015.5153 23.7669 8.2288 208.9591 51.5977 169.3515 50.2770 109.3592 68.4499 231.7102 6.1012 6.5526 2.0016 8.6449 9.5772 14.7534 4.0562 0.3616 12.6750 1.3471 32.6236 35.3432
temp: 298.150 k
press: 1.00000 atm
elementType: 16 9 9 9 9 9 9 8 8 8 8 7 7 6 6 6 6 6 6 6 6 6 6 6 6 6 6 6 6 6 1 1 1 1 1 1 1 1 1 1 1 1
symmnumber: 1
zpe: 708766.0 jmol-1
zpe.correction: 0.269955 hartree
zpe.thermalcorrener: 0.299524 hartree
zpe.thermalcorrenthalpy: 0.300469 hartree
zpe.thermalcorrgfe: 0.203997 hartree
zpe.sumelectzpe: -2060.179468 hartree
zpe.sumelectthermal: -2060.149898 hartree
zpe.sumelectthermalent: -2060.148954 hartree
zpe.sumelectthermalfe: -2060.245426 hartree
dipole: 9.7345 -7.6687 2.0819
dipole: 12.5660
quadrupole: -173.1313 -178.9091 -188.6585
quadrupole: -29.9208 1.3909 2.6063
quadrupole: 7.1017 1.3238 -8.4255 -29.9208 1.3909 2.6063
hfenergy: -2060.4494228 hartree
pointgroup: C01 [X(C17H12F6N2O4S1)]
dipole: -3.8198137 -2.7463129 1.5193205 debye
polarizability: 419.5556152|26.2554157|179.4673489|15.3439686|-44.0795889|206.8836149 unknown
InChI: InChI=1S/C17H12F6N2O4S/c1-8-7-9(5-6-12(8)30(28,29)17(22,23)15(20)21)24-16(27)25-14(26)13-10(18)3-2-4-11(13)19/h2-7,15,24-25H,1H3
charge 0 multiplicity 1
42 atoms
S  5.073086 0.727546 0.795663
F  6.056543 -0.097896 -1.766415
F  4.846044 -1.681754 -0.64831
F  7.558215 -2.401931 -0.700921
F  8.136073 -0.313991 0.076411
F  -6.635347 0.367194 -2.476576
F  -4.759664 -1.115088 1.757654
O  5.458774 0.060926 2.242829
O  5.631527 2.186976 0.356343
O  -1.622888 1.288732 -1.447082
O  -4.512094 1.672041 -1.264115
N  -0.976678 0.168322 0.528674
N  -3.198785 0.056845 -0.167626
C  3.199072 0.578995 0.5869
C  2.524619 1.159635 -0.514946
C  5.847824 -0.698396 -0.524619
C  2.556442 -0.101728 1.636131
C  1.114789 1.02352 -0.525779
C  0.430041 0.334789 0.511995
C  1.159635 -0.223294 1.598674
C  7.11939 -1.302105 0.095604
C  3.218573 1.892395 -1.646655
C  -1.901118 0.584294 -0.451393
C  -5.630477 -0.284782 -0.363548
C  -4.4185 0.584636 -0.653185
C  -6.731466 -0.310529 -1.263098
C  -5.821254 -1.054285 0.810184
C  -7.921212 -1.015583 -1.012258
C  -6.983612 -1.769886 1.121541
C  -8.046341 -1.741298 0.191267
H  3.145761 -0.509961 2.463383
H  0.538816 1.461173 -1.34332
H  0.639522 -0.751958 2.40618
H  6.955157 -1.641133 1.131614
H  3.85384 1.208676 -2.239991
H  2.475747 2.335967 -2.327602
H  3.879137 2.689392 -1.265179
H  -1.355964 -0.264494 1.37472
H  -3.265723 -0.7604 0.445496
H  -8.721549 -0.989835 -1.75602
H  -7.046379 -2.326054 2.059977
H  -8.968573 -2.28948 0.403401
