program: Gaussian 09
title: 000180823
version: EM64L-G09RevD.01
frameworkgroup: C1[X(C20H25NO3)]
method: RPBEPBE
basis: SDD
operation: Freq
keyword: #p
keyword: freq=noraman
keyword: PBEPBE/SDD
title: #p freq=noraman PBEPBE/SDD
converged: YES YES NO NO
title: Mulliken charges:
elementType: O O O N C C C C C C C C C C C C C C C C C C C C H H H H H H H H H H H H H H H H H H H H H H H H H
charge: -0.265886 -0.271643 -0.309703 0.033380 -0.364136 -0.398805 -0.399073 -0.311132 -0.275852 0.353901 -0.365140 -0.321124 0.324294 -0.335819 -0.394601 0.342902 -0.191554 -0.405597 -0.359842 -0.384579 -0.207221 -0.194297 -0.664383 -0.255745 0.191143 0.190693 0.217040 0.216805 0.213186 0.213150 0.205016 0.205594 0.200413 0.200708 0.252948 0.250821 0.266912 0.254238 0.237199 0.229065 0.210688 0.265090 0.255243 0.225788 0.227837 0.222341 0.212889 0.228644 0.228202
chargesum: 0.00000
title: Mulliken charges with hydrogens summed into heavy atoms:
elementType: O O O N C C C C C C C C C C C C C C C C C C C C
charge: -0.265886 -0.271643 -0.309703 0.033380 0.017700 0.035040 0.027262 0.099477 0.125269 0.353901 -0.112192 -0.070302 0.324294 -0.068906 -0.140363 0.342902 0.045645 0.034157 -0.094751 -0.129336 0.018567 0.033540 -0.000509 -0.027542
polarizability: 4.11056146e+02 3.82652601e+00 1.89906746e+02 6.68381277e-01 8.90689332e+00 1.53002812e+02
1716.lowfreq: -9.5163 -5.3642 -2.2626 -0.0012 -0.0005 0.0005 5.9093 14.4007 18.8061
frequency: -1.6065 13.5721 18.6200 24.5611 32.8758 41.9978 59.2613 63.4856 70.2047 85.0355 98.6530 125.3721 130.3159 139.7108 150.5478 157.3475 175.2098 202.1225 206.0175 226.6503 259.2553 292.2463 327.9135 342.9987 366.5161 385.4612 410.9904 418.5204 422.5642 469.0364 487.4172 501.3065 508.6788 540.1421 558.9620 592.0797 611.8881 635.8159 691.3496 701.8942 723.5322 745.2289 759.9934 774.8699 782.8446 793.6664 806.8510 828.8626 836.7939 852.6183 855.6065 856.3140 902.3603 904.0173 921.6371 929.9836 954.5901 966.0508 968.1258 971.0212 984.6591 985.4374 986.9147 997.3237 1019.5523 1035.0798 1038.4140 1050.5811 1071.1242 1078.5089 1083.2330 1108.1868 1110.6225 1141.4419 1150.2081 1162.2533 1163.4413 1166.2603 1170.2584 1180.0918 1200.4338 1226.7027 1237.2047 1241.4442 1248.5163 1269.1010 1287.7308 1288.1006 1288.5729 1292.4217 1304.9147 1309.0606 1330.9120 1353.1789 1366.2577 1376.7536 1384.2805 1388.0531 1389.5760 1419.9612 1442.6250 1457.9173 1467.8049 1470.5797 1471.3701 1476.5473 1476.9384 1484.0013 1484.2991 1491.6336 1495.0513 1584.3351 1593.9678 1595.2939 1606.0424 1624.0552 2941.4276 2958.0570 2970.7354 2977.7696 2983.6911 2991.1416 2996.9154 2998.6361 3002.9342 3024.1213 3044.1808 3056.0633 3058.4677 3068.1789 3083.4169 3090.2739 3128.8728 3138.2255 3150.2660 3155.3564 3156.0173 3164.9128 3170.4817 3173.5212 3175.9654
redmass: 3.8533 4.3586 3.9373 3.1819 5.0709 3.9429 3.7356 2.2598 4.2330 3.5734 2.6276 2.2626 3.9729 3.3280 2.6490 3.3675 5.9181 4.4329 1.5927 3.3262 2.8574 4.0814 5.1423 5.2524 4.3267 4.1644 2.9543 3.0493 3.4659 4.3679 3.2816 2.8623 3.6794 3.9998 6.2486 4.7440 6.4926 6.7811 2.3933 4.4403 3.7784 1.0709 1.6726 1.2676 1.1269 5.5339 1.2630 1.5860 1.3139 5.7843 1.5736 2.7264 1.4195 1.7644 1.3534 1.3519 1.3363 1.1814 1.3551 7.9182 1.3074 5.8877 5.6081 2.6792 2.0969 4.0012 2.6223 3.8158 1.6445 1.5023 2.1711 1.7209 2.0749 1.5195 1.8860 2.1042 1.2004 1.1280 1.1386 1.5855 2.8431 1.3269 4.7196 1.3423 1.1956 1.1586 1.1752 1.2577 1.0850 1.2964 1.3170 1.3393 1.5771 1.4520 4.0108 1.5268 2.0744 3.9198 1.2093 3.9411 2.3472 1.0787 1.1613 1.4313 1.3190 1.0444 1.2105 1.3352 1.0621 1.3926 1.1940 7.2243 7.1439 6.6296 6.3900 6.7801 1.0549 1.0587 1.0566 1.0632 1.0362 1.0591 1.0601 1.1046 1.1008 1.1061 1.0902 1.1062 1.0959 1.1052 1.0991 1.1013 1.0848 1.0893 1.0882 1.0877 1.0929 1.0957 1.0967 1.1003 1.0966
irintensity: 0.0982 0.3081 0.0341 0.2468 0.6602 0.9292 0.1566 0.7465 1.1799 0.6091 2.1968 0.1644 0.9643 2.3183 3.5415 6.0373 2.2226 1.1049 1.3758 1.1352 2.1838 0.9772 2.3389 1.2278 8.2875 0.6840 0.7045 0.3591 1.8965 10.5948 9.9543 35.4650 8.1389 2.6772 4.1645 1.3799 3.0038 1.0159 30.4144 1.9036 13.5729 11.1625 94.4775 9.2142 1.8369 27.1363 5.8316 50.0773 18.3737 92.3932 52.7672 86.9342 5.5377 7.4253 20.2545 0.2768 0.2546 0.0424 0.8262 37.6649 0.6759 3.0105 153.0452 12.3109 15.2645 100.7638 4.6781 3.1036 4.7777 10.6888 3.3589 7.8222 10.5823 1.5757 7.3991 2.3162 0.0655 2.9182 0.9897 218.9633 660.7499 0.0017 20.6986 12.5751 0.9709 0.4168 1.8054 2.1557 0.0091 3.6218 0.4159 0.4651 2.1080 6.4499 3.5064 42.8503 20.7351 6.2608 8.3843 4.4365 1.4549 10.0690 90.2193 171.4034 84.1147 11.5784 10.8177 144.2785 10.3754 64.6690 50.3410 13.5989 0.2046 32.5179 53.7592 20.4008 32.2809 20.2615 61.1550 31.1053 34.0507 11.6157 60.1062 29.6804 6.1187 11.2705 6.2233 2.4108 6.7457 129.6025 56.3646 45.1870 2.2571 13.0290 14.3971 16.1631 26.6856 13.9077 6.9915 10.0972 3.2126
temp: 298.150 k
press: 1.00000 atm
elementType: 8 8 8 7 6 6 6 6 6 6 6 6 6 6 6 6 6 6 6 6 6 6 6 6 1 1 1 1 1 1 1 1 1 1 1 1 1 1 1 1 1 1 1 1 1 1 1 1 1
symmnumber: 1
zpe: 1061389.3 jmol-1
zpe.correction: 0.404262 hartree
zpe.thermalcorrener: 0.428331 hartree
zpe.thermalcorrenthalpy: 0.429275 hartree
zpe.thermalcorrgfe: 0.346014 hartree
zpe.sumelectzpe: -1055.678864 hartree
zpe.sumelectthermal: -1055.654795 hartree
zpe.sumelectthermalent: -1055.653851 hartree
zpe.sumelectthermalfe: -1055.737111 hartree
dipole: -2.5041 0.4903 -0.6887
dipole: 2.6430
quadrupole: -116.8160 -140.0834 -144.9485
quadrupole: 4.4521 0.4715 0.2690
quadrupole: 17.1333 -6.1341 -10.9992 4.4521 0.4715 0.2690
hfenergy: -1056.0831256 hartree
pointgroup: C01 [X(C20H25N1O3)]
dipole: 0.9849399 -0.3019466 -0.1412414 debye
polarizability: 411.0112833|3.2438334|172.660624|-3.7991655|-20.4765242|170.293797 unknown
InChI: InChI=1S/C20H25NO3/c1-2-15-21-23-17-8-4-7-16-22-18-11-13-20(14-12-18)24-19-9-5-3-6-10-19/h3,5-6,9-15H,2,4,7-8,16-17H2,1H3
charge 0 multiplicity 1
49 atoms
O  -0.066056 0.049734 0.864044
O  7.310963 -0.106773 0.429466
O  -5.429775 0.930668 -0.640118
N  8.503627 0.113424 -0.409434
C  3.575454 0.216738 -0.251899
C  2.33798 -0.001702 0.64782
C  4.898153 -0.054999 0.50096
C  1.029223 0.267164 -0.098057
C  6.118905 0.182863 -0.392955
C  -1.38098 0.259565 0.417776
C  -2.392376 0.065257 1.39325
C  -1.734197 0.644589 -0.899769
C  -4.093826 0.622426 -0.262117
C  -3.745798 0.250563 1.059843
C  -3.095949 0.821872 -1.23453
C  -6.502141 0.080782 -0.274349
C  9.589966 -0.122141 0.28032
C  10.941195 0.030433 -0.375972
C  -6.34935 -1.298795 0.001998
C  -7.78057 0.684403 -0.273704
C  -7.497853 -2.070544 0.290075
C  -8.917113 -0.101058 0.012463
C  11.761798 -1.284471 -0.328049
C  -8.783065 -1.480809 0.299625
H  3.513386 -0.445812 -1.140336
H  3.576807 1.258422 -0.635566
H  2.389078 0.665481 1.529305
H  2.325814 -1.040017 1.03067
H  4.914849 -1.099215 0.868479
H  4.966198 0.601254 1.390046
H  0.912643 -0.423657 -0.959958
H  0.993375 1.311761 -0.473952
H  6.112729 -0.485865 -1.276575
H  6.164832 1.232188 -0.746126
H  -2.0955 -0.219081 2.407199
H  -0.97253 0.805839 -1.667466
H  -4.523287 0.118669 1.818777
H  -3.391783 1.121378 -2.244334
H  9.545899 -0.443878 1.335319
H  10.79901 0.359517 -1.42091
H  11.506042 0.829105 0.146795
H  -5.358767 -1.763137 -0.018651
H  -7.861157 1.752166 -0.498677
H  -7.383283 -3.139754 0.501287
H  -9.908027 0.366472 0.01343
H  12.75787 -1.13568 -0.782315
H  11.910712 -1.627289 0.712647
H  11.246647 -2.089471 -0.881155
H  -9.666973 -2.086988 0.524078
