program: Gaussian 09
title: 000180876
version: EM64L-G09RevD.01
frameworkgroup: C1[X(C20H31ClO5)]
method: RPBEPBE
basis: SDD
operation: Freq
keyword: #p
keyword: freq=noraman
keyword: PBEPBE/SDD
title: #p freq=noraman PBEPBE/SDD
converged: YES YES NO NO
title: Mulliken charges:
elementType: Cl O O O O O C C C C C C C C C C C C C C C C C C C C H H H H H H H H H H H H H H H H H H H H H H H H H H H H H H H
charge: -0.058780 -0.266473 -0.295204 -0.291134 -0.425454 -0.228892 0.173546 -0.415629 -0.386956 0.516122 -0.787841 -0.721461 -0.346651 -0.360114 -0.389880 -0.440367 -0.381483 -0.337571 0.460189 -0.696949 -0.340384 -0.241905 -0.291253 -0.266440 -0.330716 0.214005 0.196848 0.193313 0.212857 0.198910 0.214265 0.228475 0.220068 0.222498 0.216940 0.209777 0.184970 0.188467 0.197955 0.193544 0.255833 0.249314 0.273646 0.211207 0.208901 0.215307 0.236939 0.219083 0.195537 0.258134 0.214088 0.206965 0.265521 0.197592 0.210932 0.246505 0.393285
chargesum: 0.00000
title: Mulliken charges with hydrogens summed into heavy atoms:
elementType: Cl O O O O O C C C C C C C C C C C C C C C C C C C C
charge: -0.058780 -0.266473 -0.295204 -0.291134 -0.032169 -0.228892 0.173546 -0.025468 0.024811 0.516122 -0.125033 -0.072247 0.026786 0.031385 -0.134047 -0.191053 -0.381483 -0.063925 0.460189 -0.061534 0.115639 0.211767 0.129800 0.196674 0.126720 0.214005
polarizability: 2.86129639e+02 -1.84356521e+01 2.42417255e+02 2.09599335e+01 2.13868627e+00 2.11576343e+02
1716.lowfreq: -9.4236 -6.2371 -3.3716 0.0010 0.0011 0.0013 10.0967 13.0950 18.1056
frequency: 6.4518 11.9829 17.8504 26.6256 28.3393 41.1900 52.5601 56.5696 75.1789 77.2199 93.4883 97.2305 117.0062 124.1354 136.6908 151.7639 154.0850 158.1750 169.8373 198.6119 223.8341 228.1550 228.7590 237.0153 245.9735 261.2766 272.5602 288.1602 293.8083 301.8549 314.5614 331.5400 348.8357 367.3251 384.5707 400.0543 417.8022 437.7983 442.6370 475.6620 500.4172 507.2222 525.2149 537.8194 548.0469 612.7445 644.7455 667.3003 679.8160 716.7388 723.2455 726.3398 748.0544 751.0589 780.9838 800.9019 817.0978 825.7479 837.7901 859.5041 875.1618 888.8282 897.5817 900.5355 919.4213 936.7528 945.5280 960.3073 967.5323 979.3471 993.4805 997.5551 1018.1144 1021.9482 1033.0662 1045.8962 1060.3553 1068.4467 1070.5344 1074.0767 1092.0978 1101.1818 1117.0912 1121.5165 1127.1710 1159.0628 1170.5325 1196.5696 1199.4029 1204.6674 1213.2095 1224.6448 1234.0523 1239.8409 1248.1933 1258.2936 1270.6436 1279.1083 1282.4866 1286.4192 1304.3663 1307.1005 1325.1432 1337.8347 1345.8600 1347.8299 1351.4401 1352.9165 1359.9321 1373.0679 1375.9723 1380.5212 1387.9237 1393.9535 1408.1722 1441.8688 1443.9228 1457.2051 1462.3461 1464.0113 1465.9105 1466.9706 1468.3810 1469.8685 1471.7748 1476.2812 1479.8978 1482.6505 1487.0865 1488.1743 1492.3004 1556.3183 1616.0126 1656.7054 2939.2426 2945.1604 2950.0475 2958.4106 2964.6035 2969.6652 2971.3992 2971.7954 2973.1889 2977.7561 2986.8012 2989.6427 3002.9758 3010.3784 3019.5036 3041.8466 3047.7842 3053.0402 3066.0575 3067.9018 3070.3924 3070.5806 3072.4978 3075.4428 3078.5800 3082.4081 3114.5703 3153.1835 3156.5730 3178.9348 3350.7245
redmass: 4.1408 6.2681 3.2424 2.5642 4.0772 7.0511 5.5843 5.3544 4.3381 3.6055 3.5361 5.7993 2.9429 2.0884 3.8811 4.2421 4.9721 3.6854 4.3039 3.1997 1.1092 1.2274 2.7584 3.2829 4.3462 3.3553 3.1773 3.1056 1.2824 2.2746 2.7586 3.9916 2.8954 3.1019 4.6358 2.6078 3.5330 3.1761 2.9609 2.6103 3.1884 3.1279 3.0385 3.5431 3.2569 3.6889 4.6960 2.5076 4.3555 2.7733 1.1330 1.6779 1.2125 2.8648 4.5863 3.5776 1.4457 1.4097 5.6352 2.1087 1.5217 2.7353 1.9513 2.4294 1.7333 1.4509 1.3423 1.3510 2.1031 3.0488 1.5983 2.7515 2.4630 2.9273 3.0673 2.8341 2.1194 2.9593 1.7729 2.0811 2.9260 2.1511 2.7804 2.1154 2.1816 2.4913 1.5974 1.7419 1.1063 2.2758 1.1633 1.1750 1.7346 1.6276 1.4549 1.2692 1.3610 1.2462 1.3208 1.0569 1.3235 1.4228 1.5256 1.5306 1.4776 1.3010 2.8534 1.8416 1.3085 1.3567 1.2411 1.3531 1.2170 1.2150 4.0911 1.0795 1.0865 1.0704 1.0708 1.0837 1.0881 1.0852 1.0754 1.0768 1.0729 1.0425 1.0733 1.0799 1.2881 1.5771 1.1332 6.9552 7.3005 9.1490 1.0660 1.0634 1.0587 1.0586 1.0591 1.0664 1.0371 1.0388 1.0535 1.0363 1.0654 1.0976 1.0996 1.0600 1.1033 1.1044 1.0979 1.0951 1.0998 1.1006 1.0993 1.0991 1.0976 1.0998 1.0989 1.1053 1.0991 1.0908 1.0879 1.0947 1.0653
irintensity: 0.1478 0.1708 0.2434 0.4599 0.3606 0.0995 0.0268 1.2213 1.4237 0.8473 0.9295 5.6583 0.3681 0.2616 2.5596 7.0294 1.8238 4.1680 1.8408 0.2730 0.0128 0.5584 2.2056 2.7873 6.8008 5.3188 0.4409 1.9496 0.8816 4.6487 3.8582 1.5094 0.9297 2.9089 0.9919 4.5408 0.3069 6.9877 2.6659 10.1263 3.4385 0.6505 5.2490 47.9465 6.6845 9.9521 5.7437 74.4199 14.8751 4.2099 10.4553 113.2469 1.8921 12.1170 7.0859 11.9727 47.4651 12.8279 21.2243 10.4926 11.7105 22.1123 17.3596 15.3267 4.0735 2.6291 0.1708 1.7821 44.1155 29.8576 1.2041 9.1964 4.3333 15.4399 84.9881 91.3540 2.6099 52.5633 6.6278 2.2597 77.3349 1.4651 33.2790 134.6268 18.7007 3.2995 18.0197 5.3293 6.1633 5.9794 18.9611 5.8019 69.2770 50.0207 11.8845 43.5464 37.1173 53.3722 3.1113 0.5149 4.0774 35.0161 5.2951 20.2683 2.5303 9.1712 14.4339 4.6516 1.2121 3.9421 25.1559 6.5898 12.0242 12.3587 12.0659 12.1703 7.6185 0.6192 0.5664 3.3721 15.3838 7.7732 8.6463 8.4492 5.9505 11.7115 1.6143 13.2510 63.9224 81.5037 67.9437 13.5376 16.4457 278.5592 80.7540 42.8011 6.0830 20.7093 15.3017 79.9469 47.7702 4.4264 108.7379 29.7409 48.5686 1.4832 8.9936 48.6119 0.8941 90.0765 17.2286 14.9805 3.1453 69.8298 58.9159 106.2439 21.7283 37.1207 45.0523 17.3472 12.3311 3.6746 7.3772 1.6294 460.0682
temp: 298.150 k
press: 1.00000 atm
elementType: 17 8 8 8 8 8 6 6 6 6 6 6 6 6 6 6 6 6 6 6 6 6 6 6 6 6 1 1 1 1 1 1 1 1 1 1 1 1 1 1 1 1 1 1 1 1 1 1 1 1 1 1 1 1 1 1 1
symmnumber: 1
zpe: 1248897.9 jmol-1
zpe.correction: 0.475680 hartree
zpe.thermalcorrener: 0.505588 hartree
zpe.thermalcorrenthalpy: 0.506532 hartree
zpe.thermalcorrgfe: 0.409587 hartree
zpe.sumelectzpe: -1614.821058 hartree
zpe.sumelectthermal: -1614.791150 hartree
zpe.sumelectthermalent: -1614.790206 hartree
zpe.sumelectthermalfe: -1614.887151 hartree
dipole: -1.1766 4.4078 0.4336
dipole: 4.5827
quadrupole: -161.1552 -170.7569 -155.1466
quadrupole: 12.4056 2.8935 -3.5393
quadrupole: 1.1977 -8.4040 7.2063 12.4056 2.8935 -3.5393
hfenergy: -1615.296738 hartree
pointgroup: C01 [X(C20H31Cl1O5)]
dipole: -0.7789849 -1.3510212 0.904782 debye
polarizability: 287.6413073|-8.1520318|233.9907249|-26.7470979|-9.409134|218.4912051 unknown
InChI: InChI=1S/C20H31ClO5/c1-4-5-6-9-20(2,3)16-7-8-18(17(21)14-16)26-13-12-24-10-11-25-15-19(22)23/h7-8,14,22H,4-6,9-13,15H2,1-3H3
charge 0 multiplicity 1
57 atoms
Cl 0.981739 2.563839 -0.915915
O  1.686507 -0.203012 -1.66879
O  2.681453 -2.80535 -0.44893
O  5.271764 -1.244778 0.58856
O  3.549392 1.197911 0.659827
O  5.297889 1.871719 -0.726678
C  -3.005221 0.207119 1.760138
C  -4.048615 1.166239 1.089613
C  -4.643624 0.688917 -0.254049
C  -1.768792 0.032682 0.846784
C  -3.683961 -1.148264 2.086678
C  -2.5483 0.851652 3.10519
C  -5.554329 1.753407 -0.907614
C  -6.193832 1.278003 -2.232149
C  -1.047255 1.180696 0.415861
C  -1.275156 -1.228366 0.431626
C  0.079734 1.04761 -0.403236
C  -0.129486 -1.358767 -0.384415
C  0.564324 -0.21203 -0.839068
C  -7.088541 2.350628 -2.88993
C  2.104387 -1.435472 -2.370424
C  3.237869 -2.151829 -1.644058
C  3.649859 -3.05834 0.626565
C  4.120757 -1.790758 1.346643
C  5.676509 0.113946 0.974496
C  4.86455 1.162537 0.207057
H  -4.871588 1.331925 1.816068
H  -3.576168 2.157888 0.933592
H  -3.822129 0.432513 -0.95294
H  -5.230234 -0.239256 -0.101104
H  -3.010473 -1.808699 2.663689
H  -3.999903 -1.689284 1.177368
H  -4.584624 -0.970492 2.702933
H  -1.801619 0.21496 3.614098
H  -2.091945 1.845244 2.944551
H  -3.413835 0.981004 3.782174
H  -6.357948 2.041214 -0.196895
H  -4.963888 2.674399 -1.097583
H  -5.390273 0.981489 -2.936913
H  -6.79112 0.363121 -2.039895
H  -1.362844 2.184967 0.714813
H  -1.777402 -2.144157 0.755521
H  0.262523 -2.351381 -0.61962
H  -6.507557 3.263526 -3.120779
H  -7.917561 2.642932 -2.217688
H  -7.532527 1.985204 -3.83427
H  2.470356 -1.078792 -3.349356
H  1.2397 -2.105563 -2.532052
H  3.674638 -2.917668 -2.323444
H  4.029751 -1.433113 -1.367442
H  3.100087 -3.701177 1.335832
H  4.53239 -3.616297 0.248009
H  3.297999 -1.053158 1.395635
H  4.457114 -2.03976 2.376946
H  5.569841 0.27204 2.066474
H  6.731378 0.212878 0.677672
H  2.963739 1.76115 0.069828
