program: Gaussian 09
title: 000180828
version: EM64L-G09RevD.01
frameworkgroup: C1[X(C18H28O4)]
method: RPBEPBE
basis: SDD
operation: Freq
keyword: #pfreq=noraman
keyword: PBEPBE/SDD
title: #p freq=noraman PBEPBE/SDD
converged: YES YES NO NO
title: Mulliken charges:
elementType: O O O O C C C C C C C C C C C C C C C C C C H H H H H H H H H H H H H H H H H H H H H H H H H H H H
charge: -0.267263 -0.247712 -0.413678 -0.230993 0.184426 -0.413643 -0.387162 0.477306 -0.726606 -0.792489 -0.346225 -0.360283 -0.390708 -0.412430 -0.409540 -0.389480 0.346728 -0.697683 -0.276526 -0.287294 -0.354821 0.202550 0.192498 0.191465 0.215650 0.196833 0.206841 0.213940 0.222443 0.215294 0.225736 0.216195 0.183873 0.185966 0.193589 0.198953 0.246581 0.222647 0.243943 0.242272 0.209803 0.208617 0.214852 0.229318 0.199070 0.234987 0.201525 0.271579 0.227875 0.381179
chargesum: 0.00000
title: Mulliken charges with hydrogens summed into heavy atoms:
elementType: O O O O C C C C C C C C C C C C C C C C C C
charge: -0.267263 -0.247712 -0.032499 -0.230993 0.184426 -0.029680 0.025322 0.477306 -0.083382 -0.135264 0.023614 0.032259 -0.144126 -0.189783 -0.165597 -0.147208 0.346728 -0.064411 0.151862 0.149219 0.144633 0.202550
polarizability: 2.76448574e+02 -1.17574779e+01 1.72740982e+02 -1.30377078e+00 -9.16286254e-01 1.86638072e+02
1716.lowfreq: -9.3704 -6.0305 -0.0009 -0.0008 0.0010 4.3306 9.9468 16.0399 23.7263
frequency: 9.1244 15.6701 23.1063 29.0617 42.8702 47.4946 56.7138 72.5905 90.1322 97.6194 100.6771 116.2779 126.4234 145.8654 194.1981 218.8265 223.0250 225.5621 236.2398 251.7365 254.7143 275.2453 296.0493 306.6714 321.2562 346.1408 359.2301 397.1946 414.3909 416.3895 436.6456 467.1697 482.1456 495.1459 502.0079 549.7598 564.6882 619.6785 632.3230 637.4078 667.1661 722.5033 736.0141 747.2158 779.2303 797.4019 816.5423 822.7236 832.9267 836.3832 854.1791 895.2082 908.0097 917.0498 932.0604 938.7051 957.8885 965.4398 993.0883 995.0666 1002.1293 1017.2731 1018.0469 1025.9464 1039.0278 1060.1106 1070.0202 1074.4337 1098.3218 1099.4969 1120.0217 1126.8202 1127.3050 1164.2771 1186.1300 1196.4884 1198.9843 1204.5274 1230.1285 1238.5484 1241.1701 1247.3383 1254.1550 1263.9924 1279.5537 1284.7698 1302.6602 1305.7958 1311.3952 1343.8226 1350.0903 1352.8919 1359.9405 1372.2271 1376.3859 1388.3240 1395.6404 1396.8124 1414.8620 1426.4945 1455.1573 1458.4513 1463.5091 1466.0654 1467.5702 1468.4593 1471.4303 1475.8197 1480.2352 1484.3722 1487.8743 1495.0796 1502.1724 1579.7983 1621.4694 1675.4132 2946.1029 2948.6761 2954.5237 2961.1162 2965.2143 2966.2981 2969.4821 2970.7023 2973.1153 2977.9349 2988.8414 3001.0347 3018.8114 3030.0902 3040.2699 3041.1997 3063.4931 3066.9806 3069.1753 3069.3385 3074.2209 3074.8804 3078.1876 3122.0112 3146.6550 3158.3391 3168.7528 3513.1375
redmass: 4.8370 5.5083 4.3755 5.0044 2.2172 2.6205 3.8368 3.6959 3.3542 3.7889 6.5278 3.2171 1.9120 3.5178 3.0339 1.5796 1.5715 1.2298 2.6212 3.0736 3.9115 3.4679 2.5018 1.1052 3.1929 2.9042 2.7144 3.5982 2.9785 3.6002 3.6749 2.9174 1.8226 3.0354 3.5455 3.0822 2.5299 2.1513 5.2862 2.4675 3.9810 1.0875 2.7199 1.2764 4.2333 2.8554 1.5784 1.4368 3.2565 1.5832 2.0076 1.8551 3.4345 1.7492 1.4644 1.3682 1.3256 1.3594 1.5807 1.9857 2.8738 2.5346 2.6421 2.6950 2.6059 2.0599 1.6956 2.2349 2.6818 2.0132 2.0392 3.1168 1.7114 2.5080 1.3503 1.7922 1.0862 2.3462 2.3883 1.1448 1.5114 1.5031 1.4244 1.3117 1.3664 1.0538 1.3495 1.3592 1.3535 1.4770 1.6450 1.4225 3.3704 1.4690 1.2319 1.2174 1.5082 1.2616 3.2804 1.0918 1.0729 1.1120 1.0703 1.0632 1.0826 1.0632 1.0685 1.0427 1.0726 1.0569 1.0885 1.0640 2.2553 6.9983 6.3627 8.7174 1.0676 1.0589 1.0586 1.0561 1.0587 1.0615 1.0358 1.0366 1.0578 1.0371 1.0971 1.0993 1.1032 1.1041 1.1028 1.1043 1.0998 1.1006 1.0990 1.0993 1.0997 1.0918 1.0986 1.0879 1.0869 1.0936 1.0958 1.0642
irintensity: 0.1466 0.8183 0.4962 0.1058 0.2522 0.2673 0.4548 0.7163 0.4922 1.7990 2.4015 1.9629 0.0506 1.1143 0.3895 0.5171 0.1174 0.0818 1.3832 3.2515 4.1730 0.7651 8.2449 0.0746 1.7461 0.6185 0.6797 8.6478 1.1316 6.5047 3.4698 2.8893 24.3870 6.5223 20.4178 4.8430 12.8987 82.2921 10.4918 70.0279 18.6583 10.9630 1.8362 0.7026 4.3138 2.2222 18.8980 5.9666 5.7647 55.7028 0.3286 9.5751 75.7610 2.6083 1.3094 0.7840 0.1646 0.1192 0.7318 32.8253 16.8822 20.2015 45.7561 395.1840 23.4104 2.1123 2.7143 1.3969 8.5651 8.1071 12.6352 41.4115 5.3990 4.6315 119.0746 2.0343 4.2279 6.6133 177.5440 25.6535 7.3969 5.4331 12.2142 8.4830 6.1156 0.1294 1.6403 25.8768 3.4198 2.3983 0.5164 4.5125 3.5012 20.8665 25.5675 12.4482 1.6938 21.2593 1.5309 28.5522 1.2193 53.4379 0.1185 1.0658 22.8550 5.0663 3.1137 11.9594 1.2557 8.6329 16.1788 25.6033 130.2926 4.1299 52.1466 202.1990 35.9060 4.5506 29.0286 28.7462 19.5407 37.2078 28.7903 42.3484 89.2694 33.3123 3.2597 10.3893 0.9489 37.1689 26.5301 85.1359 7.2142 67.4049 120.0441 48.9535 38.7445 8.7161 46.5280 22.4808 8.6458 20.3185 7.4555 23.4580
temp: 298.150 k
press: 1.00000 atm
elementType: 8 8 8 8 6 6 6 6 6 6 6 6 6 6 6 6 6 6 6 6 6 6 1 1 1 1 1 1 1 1 1 1 1 1 1 1 1 1 1 1 1 1 1 1 1 1 1 1 1 1
symmnumber: 1
zpe: 1116056.6 jmol-1
zpe.correction: 0.425084 hartree
zpe.thermalcorrener: 0.450142 hartree
zpe.thermalcorrenthalpy: 0.451086 hartree
zpe.thermalcorrgfe: 0.365380 hartree
zpe.sumelectzpe: -1001.862301 hartree
zpe.sumelectthermal: -1001.837243 hartree
zpe.sumelectthermalent: -1001.836298 hartree
zpe.sumelectthermalfe: -1001.922005 hartree
dipole: -1.1666 -0.6239 0.1750
dipole: 1.3345
quadrupole: -109.0157 -137.4392 -132.2197
quadrupole: -0.8190 -5.7193 0.9744
quadrupole: 17.2092 -11.2143 -5.9949 -0.8190 -5.7193 0.9744
hfenergy: -1002.2873848 hartree
pointgroup: C01 [X(C18H28O4)]
dipole: -0.4507802 -0.2671521 0.0327133 debye
polarizability: 276.7243408|-6.1667465|171.7428047|7.8744914|-1.1426547|187.3604817 unknown
InChI: InChI=1S/C18H28O4/c1-4-5-6-11-18(2,3)15-7-9-16(10-8-15)22-13-12-21-14-17(19)20/h7-10,19H,4-6,11-14H2,1-3H3
charge 0 multiplicity 1
50 atoms
O  -2.137844 -1.079694 -0.106621
O  -4.570775 0.61539 -0.615185
O  -8.2082 0.960997 -0.108886
O  -7.079462 0.32646 -2.043652
C  3.659794 -1.391599 0.262639
C  4.317908 -0.076366 -0.282406
C  3.967135 1.221335 0.479179
C  2.117983 -1.300101 0.16625
C  4.151729 -2.581156 -0.618579
C  4.144681 -1.648502 1.713388
C  4.563675 2.48074 -0.190191
C  4.2436 3.785992 0.573532
C  1.26101 -1.452325 1.289649
C  1.49604 -1.0644 -1.087336
C  -0.140753 -1.373587 1.170811
C  0.094046 -0.980541 -1.231396
C  -0.732931 -1.136889 -0.091115
C  4.838213 5.041462 -0.100584
C  -2.791027 -0.81754 -1.397004
C  -4.286417 -0.730779 -1.149365
C  -5.829308 0.729888 0.078912
C  -7.053312 0.641669 -0.837124
H  5.419343 -0.217978 -0.275888
H  4.030944 0.051356 -1.346656
H  2.865499 1.32673 0.541265
H  4.338383 1.161562 1.522101
H  5.254014 -2.667781 -0.569497
H  3.869605 -2.445994 -1.678484
H  3.712619 -3.534425 -0.2714
H  3.784285 -2.622983 2.092279
H  3.810227 -0.863526 2.414444
H  5.250121 -1.668965 1.736902
H  5.665477 2.368526 -0.276078
H  4.178526 2.562118 -1.228569
H  4.628531 3.704098 1.61078
H  3.143229 3.895448 0.659135
H  1.685311 -1.634811 2.281445
H  2.114328 -0.938603 -1.984158
H  -0.791828 -1.489352 2.043086
H  -0.332922 -0.795978 -2.221916
H  4.44621 5.162184 -1.128311
H  5.940376 4.96976 -0.169514
H  4.594011 5.96025 0.464011
H  -2.431096 0.137611 -1.828808
H  -2.568519 -1.643791 -2.104146
H  -4.845152 -0.874591 -2.094054
H  -4.590723 -1.510526 -0.419457
H  -5.828421 1.718084 0.569377
H  -5.944237 -0.041074 0.873193
H  -9.00683 0.896099 -0.699999
