program: Gaussian 09
title: 000016465
version: EM64L-G09RevD.01
frameworkgroup: C1[X(C9H13N5)]
method: RPBEPBE
basis: SDD
operation: Freq
keyword: #pfreq=noraman
keyword: PBEPBE/SDD
title: #p freq=noraman PBEPBE/SDD
converged: YES YES NO NO
title: Mulliken charges:
elementType: N N N N N C C C C C C C C C H H H H H H H H H H H H H
charge: -0.273543 -0.160343 -0.378938 -0.634532 -0.625169 0.398567 -0.328654 -0.376376 -0.656156 0.004449 -0.223765 -0.226826 -0.263759 0.265652 0.274264 0.237105 0.308661 0.202492 0.233158 0.221833 0.220724 0.225690 0.243295 0.336518 0.304369 0.362839 0.308447
chargesum: 0.00000
title: Mulliken charges with hydrogens summed into heavy atoms:
elementType: N N N N N C C C C C C C C C
charge: -0.273543 -0.160343 -0.135644 0.006354 0.046116 0.398567 -0.054390 -0.139271 0.088155 0.004449 -0.001931 -0.006103 -0.038069 0.265652
polarizability: 1.61193611e+02 1.74212930e+01 1.41586179e+02 -1.60596163e+01 6.90801296e+00 1.06284144e+02
1716.lowfreq: -11.8606 -5.9500 -0.0006 0.0005 0.0007 12.7524 43.7314 56.0666 65.4503
frequency: 43.7221 55.9306 65.4242 82.2350 121.0527 136.6259 157.7609 211.0292 237.9707 279.2251 323.0213 356.5504 398.3203 410.0592 414.0894 443.5485 455.0748 485.9595 530.4999 546.4387 563.5406 614.5637 637.2281 672.8924 688.3323 700.9043 725.6895 761.4862 801.8433 833.3191 872.5726 900.0479 936.7392 965.6518 983.2810 983.4823 1014.9733 1026.4188 1034.6863 1067.6726 1088.2370 1123.9091 1165.6496 1170.4949 1186.4513 1194.1099 1298.1612 1310.0720 1342.2962 1380.2330 1416.9506 1444.3066 1450.5691 1477.0145 1485.5336 1495.5771 1564.1252 1584.4955 1598.4535 1603.6903 1612.6332 1658.6336 2965.5671 3054.7687 3107.6404 3121.9179 3130.0306 3148.4722 3160.7451 3172.1411 3395.2315 3531.9032 3552.9918 3681.2026 3703.9734
redmass: 4.7181 4.1576 4.0025 3.8166 3.1235 1.2256 3.0147 4.0683 1.3579 3.0741 3.5902 4.0945 2.4123 2.3575 1.6893 3.5413 2.1912 1.4549 3.1410 1.1198 3.1574 6.3005 5.7492 6.7470 3.3875 2.5267 6.3052 1.7796 1.2156 1.2504 4.0420 1.4360 2.7693 1.3658 1.5850 3.2415 1.7302 2.2129 1.5951 2.6193 1.5999 1.3165 1.7078 1.0876 2.2501 1.1316 3.0306 1.9488 1.8697 6.8983 1.2314 2.4107 3.6231 1.1064 2.1778 1.0878 4.9038 6.0241 1.3394 1.6353 4.8513 2.8281 1.0375 1.0981 1.0997 1.0844 1.0889 1.0930 1.0973 1.0976 1.0750 1.0452 1.0452 1.1047 1.1042
irintensity: 5.5824 1.9810 2.4840 1.6280 4.3378 0.7729 4.1245 17.6919 35.0324 12.3460 4.1109 2.2795 114.2647 70.8572 157.9048 15.3694 11.8818 31.6598 8.2159 211.7103 2.4392 1.0796 18.7313 33.3026 3.3826 44.9839 11.3762 52.1964 93.3222 1.0423 15.7442 7.4528 118.2510 1.0883 2.6033 3.3670 43.8900 42.6622 75.2336 47.4893 18.5176 0.8400 43.1572 2.2019 9.5636 2.4477 77.7124 110.6964 130.5977 1.7076 89.5885 8.9415 113.2010 9.8777 167.3259 13.9635 316.1909 18.4715 212.1314 114.6844 71.1126 625.4714 70.2330 33.9074 1.5548 3.5477 14.3088 33.8181 21.5457 5.4283 16.6757 33.9417 47.3138 45.5992 32.2460
temp: 298.150 k
press: 1.00000 atm
elementType: 7 7 7 7 7 6 6 6 6 6 6 6 6 6 1 1 1 1 1 1 1 1 1 1 1 1 1
symmnumber: 1
zpe: 573717.3 jmol-1
zpe.correction: 0.218517 hartree
zpe.thermalcorrener: 0.232683 hartree
zpe.thermalcorrenthalpy: 0.233627 hartree
zpe.thermalcorrgfe: 0.177369 hartree
zpe.sumelectzpe: -623.470480 hartree
zpe.sumelectthermal: -623.456314 hartree
zpe.sumelectthermalent: -623.455370 hartree
zpe.sumelectthermalfe: -623.511628 hartree
dipole: -0.4553 -4.1713 3.5454
dipole: 5.4933
quadrupole: -83.8079 -74.6168 -77.3417
quadrupole: -9.9001 1.8596 3.1601
quadrupole: -5.2191 3.9720 1.2471 -9.9001 1.8596 3.1601
hfenergy: -623.6889971 hartree
pointgroup: C01 [X(C9H13N5)]
dipole: 0.1825655 -1.5492177 1.4958583 debye
polarizability: 151.9331097|17.939631|145.6118492|-24.268682|0.1605262|111.5189761 unknown
InChI: InChI=1S/C9H13N5/c1-14(9(12)13-8(10)11)7-5-3-2-4-6-7/h2-6,12H,10-11H2,1H3
charge 0 multiplicity 1
27 atoms
N  0.309464 1.364636 -0.019279
N  1.940984 -0.278977 -0.80917
N  2.194984 2.066748 -1.265171
N  2.650645 -2.322317 0.050371
N  1.846036 -0.716877 1.568945
C  -0.789193 0.45015 0.075993
C  -0.973695 -0.619996 -0.846309
C  -1.763758 0.640634 1.098257
C  0.046674 2.790791 0.298866
C  1.527586 1.066919 -0.725135
C  -2.080881 -1.483639 -0.720597
C  -2.872589 -0.22568 1.20733
C  -3.038221 -1.300679 0.305224
C  2.114026 -1.054404 0.248862
H  -0.252265 -0.767686 -1.654111
H  -1.658237 1.46824 1.807641
H  0.829502 3.380157 -0.202009
H  0.084312 2.978901 1.389419
H  -0.944679 3.094266 -0.081543
H  -2.205875 -2.29636 -1.445784
H  -3.60818 -0.056135 2.002318
H  -3.899921 -1.971344 0.390315
H  3.078657 1.724551 -1.684968
H  2.904248 -2.557967 -0.905996
H  2.513329 -3.069377 0.726054
H  1.303567 0.125078 1.752302
H  2.20748 -1.260235 2.348175
