program: Gaussian 09
title: 000180842
version: EM64L-G09RevD.01
frameworkgroup: C1[X(C16H9ClF6N2O4S)]
method: RPBEPBE
basis: SDD
operation: Freq
keyword: #p
keyword: freq=noraman
keyword: PBEPBE/SDD
title: #p freq=noraman PBEPBE/SDD
converged: YES YES NO NO
title: Mulliken charges:
elementType: Cl S F F F F F F O O O O N N C C C C C C C C C C C C C C C C H H H H H H H H H
charge: 0.036640 0.875389 -0.135943 -0.108933 -0.136910 -0.204583 -0.153143 -0.219700 -0.528293 -0.488246 -0.200159 -0.148225 -0.488924 -0.491783 -0.066298 0.229145 -0.340420 -0.234558 -0.225932 0.316992 0.174509 -0.273969 0.304464 -0.094058 0.222118 0.261095 0.291437 -0.378585 -0.372220 -0.144846 0.319193 0.286963 0.318141 0.326381 0.336710 0.341380 0.272264 0.270724 0.252183
chargesum: 0.00000
title: Mulliken charges with hydrogens summed into heavy atoms:
elementType: Cl S F F F F F F O O O O N N C C C C C C C C C C C C C C C C
charge: 0.036640 0.875389 -0.135943 -0.108933 -0.136910 -0.204583 -0.153143 -0.219700 -0.528293 -0.488246 -0.200159 -0.148225 -0.152213 -0.150403 -0.066298 0.229145 -0.021226 0.052405 0.092209 0.316992 0.174509 0.052412 0.304464 -0.094058 0.222118 0.261095 0.291437 -0.106321 -0.101496 0.107336
polarizability: 4.29253987e+02 2.12778954e-01 2.23116333e+02 1.41130602e+01 1.94939238e+01 1.64232704e+02
1716.lowfreq: -5.7633 -1.2139 -0.0014 0.0004 0.0009 1.7717 7.7815 12.4758 20.4955
frequency: 7.5827 12.4149 20.4892 25.2904 28.6786 35.3744 45.6707 54.3790 72.9426 76.9463 86.5266 107.0217 117.0412 131.9607 152.7632 160.0515 165.1301 173.4001 207.4891 210.9915 223.3786 227.7278 228.5171 237.0934 248.7189 260.6143 285.2018 314.4566 327.4624 330.5055 336.9994 359.1254 384.7075 412.4502 420.8252 441.4241 452.5579 467.2771 476.2256 495.4360 515.0888 524.2479 534.6559 561.9534 572.5519 576.9361 597.4748 612.7872 661.6781 666.9005 673.4604 685.5481 718.9746 720.6687 734.4347 751.0945 760.8910 791.4514 802.7658 809.9359 830.8893 844.0685 854.7744 877.9059 883.7325 891.3963 935.3647 950.0291 970.1554 974.5886 986.1297 988.4361 1045.4284 1047.9729 1053.8481 1085.0605 1106.8993 1157.5736 1167.3992 1169.4821 1179.8509 1203.7652 1218.8326 1226.9830 1233.3303 1239.6889 1307.5550 1309.6394 1375.2355 1379.7047 1418.2977 1434.0977 1448.4906 1463.2083 1468.5716 1515.6727 1573.2603 1590.8226 1609.6362 1621.0549 1643.2957 1684.5144 3117.8998 3164.9262 3166.8102 3173.2015 3184.7419 3194.8961 3201.3871 3497.8945 3510.5727
redmass: 11.0959 11.2289 14.2744 11.6799 9.8439 11.2843 13.0779 10.8693 7.6503 7.9653 12.1067 10.5901 8.5179 12.0483 12.4155 11.4490 13.3557 9.0557 9.0670 10.5808 14.9052 11.0376 4.8378 12.3232 11.9051 9.4454 13.9848 12.5765 12.8499 9.0596 11.4441 11.4192 10.3441 9.8004 11.7785 6.7387 4.2889 6.9018 4.9852 6.6461 9.4173 8.5916 14.1312 5.9793 3.8617 3.4805 1.9577 3.6478 4.7501 2.2047 7.3298 2.5745 5.0237 6.6186 3.8526 6.8563 2.3704 12.8096 2.6475 5.7955 7.6679 5.5059 1.4554 1.4578 1.3979 6.0681 7.6524 18.5273 1.3536 7.3921 1.3338 6.6869 7.8762 3.0281 1.9723 2.8767 2.7928 2.1818 1.4359 1.3694 6.6747 2.7629 1.1602 4.1400 2.8947 1.4901 1.7688 1.5064 10.6367 5.4459 4.6528 2.7988 3.1788 2.0512 2.1883 2.7343 7.0811 5.9491 7.1443 8.4454 4.3921 7.0257 1.0874 1.0884 1.0913 1.0936 1.0932 1.0998 1.0952 1.0778 1.0767
irintensity: 1.2696 0.0335 0.7933 2.5144 0.0509 0.2392 0.9048 6.5698 2.9193 5.3519 1.4841 1.6907 3.8354 3.0213 1.8762 0.8877 0.4739 10.7440 4.9572 1.4700 1.7006 1.3152 0.0246 2.3537 5.2386 2.2804 2.0069 3.1911 3.2461 22.0216 3.5465 27.7501 1.0464 12.1078 1.6034 132.9366 85.9804 24.5042 1.4572 2.4799 14.9762 35.2567 5.2123 1.8269 13.8047 30.4203 10.8386 91.3117 4.9161 112.5828 40.0045 68.4351 65.1957 6.5706 33.8961 1.2723 6.0251 106.7615 55.7609 44.6750 6.1777 27.9301 32.6873 28.9441 0.3521 46.3819 54.6467 69.2081 2.1038 15.2234 4.3667 76.7558 98.3907 71.6442 75.8837 30.0897 17.4646 600.8270 21.6959 223.9659 81.9814 44.4365 2.8041 330.3559 7.1397 21.9794 62.0486 28.8117 13.7402 205.6231 20.1524 89.9822 75.2023 1288.8990 257.6775 288.0467 42.1010 5.4133 183.5651 100.7620 72.4552 216.2132 1.5893 4.1385 3.6711 18.8123 0.3008 1.1503 11.5582 28.4253 81.1256
temp: 298.150 k
press: 1.00000 atm
elementType: 17 16 9 9 9 9 9 9 8 8 8 8 7 7 6 6 6 6 6 6 6 6 6 6 6 6 6 6 6 6 1 1 1 1 1 1 1 1 1
symmnumber: 1
zpe: 611742.3 jmol-1
zpe.correction: 0.233000 hartree
zpe.thermalcorrener: 0.262112 hartree
zpe.thermalcorrenthalpy: 0.263056 hartree
zpe.thermalcorrgfe: 0.166740 hartree
zpe.sumelectzpe: -2480.337234 hartree
zpe.sumelectthermal: -2480.308122 hartree
zpe.sumelectthermalent: -2480.307178 hartree
zpe.sumelectthermalfe: -2480.403495 hartree
dipole: 8.7395 2.5307 5.2609
dipole: 10.5101
quadrupole: -161.6884 -192.9593 -193.8788
quadrupole: 37.2254 17.8665 -1.6743
quadrupole: 21.1538 -10.1171 -11.0366 37.2254 17.8665 -1.6743
hfenergy: -2480.5702344 hartree
pointgroup: C01 [X(C16H9Cl1F6N2O4S1)]
dipole: -3.4319074 -2.3045132 -0.096198 debye
polarizability: 428.7761625|15.0551621|185.2895465|-10.3778825|33.907548|202.5373146 unknown
InChI: InChI=1S/C16H9ClF6N2O4S/c17-14(21)16(22,23)30(28,29)7-4-5-11(10(20)6-7)24-15(27)25-13(26)12-8(18)2-1-3-9(12)19/h1-6,14,24-25H
charge 0 multiplicity 1
39 atoms
Cl 7.988819 -1.444018 2.023058
S  5.135049 0.827455 -0.948779
F  4.999968 -0.759997 1.371931
F  5.903146 -1.856731 -0.416844
F  8.15534 -0.141828 -0.331983
F  0.514093 -1.106849 -2.466588
F  -6.551734 0.854636 2.418489
F  -4.679973 -1.31378 -1.514021
O  5.594263 2.1990 -0.188168
O  5.535948 0.456516 -2.479329
O  -1.52286 1.562319 1.235283
O  -4.399539 1.90455 1.076291
N  -0.890177 0.160823 -0.550909
N  -3.111263 0.163164 0.159696
C  3.280942 0.619144 -0.762027
C  5.91575 -0.665226 0.305392
C  2.630905 -0.202547 -1.701608
C  2.612049 1.322788 0.252022
C  7.291855 -0.224522 0.795776
C  0.500913 0.369992 -0.555869
C  1.248327 -0.302412 -1.563583
C  1.210726 1.201894 0.353731
C  -1.815614 0.718637 0.359201
C  -5.544148 -0.138986 0.44162
C  -4.32387 0.750854 0.600097
C  -6.649614 -0.006424 1.328084
C  -5.742087 -1.08663 -0.592886
C  -7.847992 -0.726832 1.186469
C  -6.912365 -1.828753 -0.79073
C  -7.978464 -1.636151 0.115853
H  3.168737 -0.711165 -2.50717
H  3.16639 1.974537 0.933892
H  7.239099 0.756454 1.291145
H  0.65392 1.744452 1.118863
H  -1.242864 -0.418458 -1.318758
H  -3.191246 -0.713887 -0.363463
H  -8.650807 -0.571034 1.911398
H  -6.978443 -2.528903 -1.626951
H  -8.907178 -2.199578 -0.010828
